記録npmvite8.2.2
条件を変更
現在の条件
vite @8.2.2debian glibc · x64 · node 22 · npm · node
API ではなくパッケージ全体の合計
プロジェクトに存在した記録のみです。この座標で実行されたものはありません。
観測 — 実際のプロジェクトのビルドがこの座標から報告されました。
この座標にはまだサンプルがない
- プロジェクト観測
- この座標にはなし
- コントラクト検証
- この座標にはなし
- 使用記録
- 1
- 独立した報告ピア
- 1
- 最終記録
- 2026-09-01
開ける証拠
依存関係のヘルス
このリリースの依存関係の組み合わせと失敗観測
観測された問題 1件 ·
変更 6件 ·
正常 1件
| ライブラリ | バージョン | ヘルス | その座標で測定されたこと | プロジェクト |
|---|---|---|---|---|
| picomatch | 4.0.7 | CANDIDATE 相関変更; 組み合わせ未証明 | コントラクト合格 | プロジェクト日 5 件 |
| postcss | 8.5.26 | CANDIDATE 相関変更; 組み合わせ未証明 | コントラクト合格 | プロジェクト日 4 件 |
| postcss | 8.5.28 | CANDIDATE 相関変更; 組み合わせ未証明 | コントラクト合格 | プロジェクト日 1 件 |
| rolldown | 1.2.6 | CANDIDATE 相関変更; 組み合わせ未証明 | コントラクト合格 | プロジェクト日 3 件 |
| rolldown | 1.2.7 | CANDIDATE 相関変更; 組み合わせ未証明 | コントラクト合格 | プロジェクト日 1 件 |
| tinyglobby | 0.2.17 | CANDIDATE 相関変更; 組み合わせ未証明 | コントラクト合格 | プロジェクト日 4 件 |
| lightningcss | 1.33.0 | PASS すべての観測で成功 | コントラクト合格 | プロジェクト日 5 件 |
測定列は各依存関係自身のリリースに関するもので、2つのリリースの組み合わせに関するものではありません。リゾルバが2つを並べたという事実は、両者が協調して動く証拠ではありません。
リリースごとの依存バージョン
このパッケージの各リリースが子をどのバージョンに解決したかです。バージョンが動いた子が先に並びます — アップグレードが足元で何かを変えた地点です。
| ライブラリ | 8.3.0 | 8.2.2 | 8.2.1 | 7.3.6 | 7.3.1 | 6.4.3 | 6.2.0 | 5.4.21 | 5.4.14 |
|---|---|---|---|---|---|---|---|---|---|
| esbuild | — | — | — | 0.28.2 | 0.27.2 | 0.25.12 | 0.25.12 | 0.21.5 | 0.21.5 |
| picomatch | 4.0.7 | 4.0.7 | 4.0.5 | 4.0.5 | 4.0.3 | 4.0.5 | — | — | — |
| postcss | 8.5.28 | 8.5.28 | 8.5.26 | 8.5.26 | 8.5.6 | 8.5.26 | 8.5.28 | 8.5.25 | 8.5.28 |
| rolldown | 1.2.8 | 1.2.7 | 1.2.4 | — | — | — | — | — | — |
| rollup | — | — | — | 4.63.3 | 4.54.0 | 4.63.3 | 4.62.4 | 4.62.3 | 4.63.1 |
| tinyglobby | 0.2.17 | 0.2.17 | 0.2.17 | 0.2.17 | 0.2.15 | 0.2.17 | — | — | — |
| fdir | — | — | — | 6.5.0 | 6.5.0 | 6.5.0 | — | — | — |
| lightningcss | 1.33.0 | 1.33.0 | 1.33.0 | — | — | — | — | — | — |
| vitest | — | — | 4.1.10 | — | — | — | — | — | — |
変動: 6 · 全リリースで同一: 3
エッジは、実機でリゾルバがあるリリースを別のリリースの隣に置いたという記録です。両者が一緒に動くという主張ではありません。その問いに答えるのは、ここに行があることではなくサンプルと契約です。
最近の失敗クラスター
-
観測済み UNKNOWN exit 1 ERR_ASSERTION 証拠の欠落 ×4 6.4.3 → 8.2.2 executionContext=node · os=linux · runtime=node@22.23 sha256:986d98189e70…node:internal/modules/run_main:<n> · triggerUncaughtException( · ^ · AssertionError [ERR_ASSERTION]: Expected values to be strictly equal:node · unclassified-diagnostic · outer node · gap stage-unknown証拠品質: complete · 環境バリアント: 2 · 初回記録: 2026-09-04 · 最終観測: 2026-09-05診断再検証候補
-
観測済み PROJECT_TEST exit 1 ERR_LOAD_URL ×1 8.2.2 executionContext=node · moduleSystem=esm · os=linux · runtime=node@22.23 sha256:a60e7101af87…Contract test failed: Error: Failed to load custom Reporter from basic · at loadCustomReporterModule (fil<path>:<n>:<n>) · at fil<path>:<n>:<n> …javascript/test-runner · test-runner-diagnostic · outer npm test証拠品質: complete · 環境バリアント: 1 · 初回記録: 2026-08-31 · 最終観測: 2026-08-31
-
観測済み UNKNOWN exit 1 証拠の欠落 ×1 8.2.2 executionContext=node · moduleSystem=esm · os=linux · runtime=node@22.23 sha256:0ce61af3f1a8…<url>]:<n> · const res = await babelPlugin.transform.handler(code, <str>); · ^ · TypeError: Cannot read properties of undefined (reading <str>)node · unclassified-diagnostic · outer node · gap stage-unknown証拠品質: complete · 環境バリアント: 1 · 初回記録: 2026-09-01 · 最終観測: 2026-09-01診断再検証候補
-
観測済み UNKNOWN exit 1 証拠の欠落 ×1 8.2.2 executionContext=node · moduleSystem=esm · os=linux · runtime=node@22.23 sha256:249ecd4b894f…fil<path>:<n> · skipFastRefresh = isProduction || config.command === <str> || config.server.hmr === false; · ^ …node · unclassified-diagnostic · outer node · gap stage-unknown証拠品質: complete · 環境バリアント: 1 · 初回記録: 2026-09-01 · 最終観測: 2026-09-01診断再検証候補
-
観測済み UNKNOWN exit 1 証拠の欠落 ×1 8.2.2 executionContext=node · moduleSystem=esm · os=linux · runtime=node@22.23 sha256:8a6df6b44383…fil<path>:<n> · if (config.experimental.bundledDev) isBundledDev = true; · ^ · TypeError: Cannot read properties of undefined (reading <str>)node · unclassified-diagnostic · outer node · gap stage-unknown証拠品質: complete · 環境バリアント: 1 · 初回記録: 2026-09-01 · 最終観測: 2026-09-01診断再検証候補
-
観測済み UNKNOWN exit 1 ERR_ASSERTION 証拠の欠落 ×1 8.2.2 executionContext=node · moduleSystem=esm · os=linux · runtime=node@22.23 sha256:8b0e67a45c04…node:internal/modules/run_main:<n> · triggerUncaughtException( · ^ · AssertionError [ERR_ASSERTION]: resolves <path> to virtual module IDnode · unclassified-diagnostic · outer node · gap stage-unknown証拠品質: complete · 環境バリアント: 1 · 初回記録: 2026-09-01 · 最終観測: 2026-09-01診断再検証候補
-
観測済み UNKNOWN exit 1 ERR_ASSERTION 証拠の欠落 ×1 8.2.2 executionContext=node · moduleSystem=esm · os=linux · runtime=node@22.23 sha256:9088da2c451a…node:internal/modules/run_main:<n> · triggerUncaughtException( · ^ · AssertionError [ERR_ASSERTION]: load code contains RefreshRuntimenode · unclassified-diagnostic · outer node · gap stage-unknown証拠品質: complete · 環境バリアント: 1 · 初回記録: 2026-09-01 · 最終観測: 2026-09-01診断再検証候補
-
観測済み UNKNOWN exit 1 証拠の欠落 ×1 8.2.2 executionContext=node · moduleSystem=esm · os=linux · runtime=node@22.23 sha256:aaa882de0091…fil<path>:<n> · const hooks = config.plugins.map((plugin) => plugin.api?.reactBabel).filter(defined); · ^ …node · unclassified-diagnostic · outer node · gap stage-unknown証拠品質: complete · 環境バリアント: 1 · 初回記録: 2026-09-01 · 最終観測: 2026-09-01診断再検証候補
-
観測済み UNKNOWN exit 1 ERR_PACKAGE_PATH_NOT_EXPORTED 証拠の欠落 ×1 8.2.2 executionContext=node · moduleSystem=esm · os=linux · runtime=node@22.23 sha256:b9a7518ba7bb…node:internal/modules/esm/resolve:<n> · return new ERR_PACKAGE_PATH_NOT_EXPORTED( · ^ …node · unclassified-diagnostic · outer node · gap stage-unknown証拠品質: complete · 環境バリアント: 1 · 初回記録: 2026-09-01 · 最終観測: 2026-09-01診断再検証候補
-
観測済み UNKNOWN exit 1 ERR_PACKAGE_PATH_NOT_EXPORTED 証拠の欠落 ×1 8.2.2 executionContext=node · moduleSystem=cjs · os=linux · runtime=node@22.23 sha256:e72340c7e3d4…node:internal/modules/cjs/loader:<n> · throw e; · ^ · Error [ERR_PACKAGE_PATH_NOT_EXPORTED]: Package subpath <str> is not defined by <str> in <path>node · unclassified-diagnostic · outer node · gap stage-unknown証拠品質: complete · 環境バリアント: 1 · 初回記録: 2026-09-04 · 最終観測: 2026-09-04診断再検証候補