Relevésnpmvite8.2.2
Changer les conditions
Conditions actuelles
vite @8.2.2debian glibc · x64 · node 22 · npm · node
total du paquet, pas une API
Enregistré comme présent dans des projets. Rien n'a été exécuté à cette coordonnée.
Observé — de vrais builds de projets ont fait remonter cette coordonnée.
pas encore d'échantillon à cette coordonnée
- Observations de projets
- rien à cette coordonnée
- Vérifications de contrat
- rien à cette coordonnée
- Enregistrements d'usage
- 1
- Pairs rapporteurs indépendants
- 1
- Dernier enregistrement
- 2026-09-01
Santé des dépendances
Combinaisons observées et preuves d'échec pour cette version
Premier échec observé
8.2.2
linux · node@22.23 · executionContext=node
4 FAIL
· stage: UNKNOWN
· fingerprint: sha256:986d98189e70ab6bb81e3ca5f5feb96281ba0dfa6e522caa6ddd3d9b148578cc
| Bibliothèque | Version | Santé | Mesuré là-bas | Projets |
|---|---|---|---|---|
| picomatch | 4.0.7 | CANDIDATE Changement corrélé; combinaison non prouvée | contrat réussi | 5 jours-projet |
| postcss | 8.5.26 | CANDIDATE Changement corrélé; combinaison non prouvée | contrat réussi | 4 jours-projet |
| postcss | 8.5.28 | CANDIDATE Changement corrélé; combinaison non prouvée | contrat réussi | 1 jour-projet |
| rolldown | 1.2.6 | CANDIDATE Changement corrélé; combinaison non prouvée | contrat réussi | 3 jours-projet |
| rolldown | 1.2.7 | CANDIDATE Changement corrélé; combinaison non prouvée | contrat réussi | 1 jour-projet |
| tinyglobby | 0.2.17 | CANDIDATE Changement corrélé; combinaison non prouvée | contrat réussi | 4 jours-projet |
| lightningcss | 1.33.0 | PASS Toutes les observations ont réussi | contrat réussi | 5 jours-projet |
La colonne de mesure porte sur la version de chaque dépendance elle-même, pas sur la paire. Qu'un résolveur ait placé deux versions côte à côte ne prouve pas qu'elles fonctionnent ensemble.
Versions des dépendances au fil des versions
Ce vers quoi chaque version de ce paquet a résolu ses enfants. L'enfant dont la version a bougé vient en premier : c'est là qu'une mise à jour a changé quelque chose sous vos pieds.
| Bibliothèque | 8.3.0 | 8.2.2 | 8.2.1 | 7.3.6 | 7.3.1 | 6.4.3 | 6.2.0 | 5.4.21 | 5.4.14 |
|---|---|---|---|---|---|---|---|---|---|
| esbuild | — | — | — | 0.28.2 | 0.27.2 | 0.25.12 | 0.25.12 | 0.21.5 | 0.21.5 |
| picomatch | 4.0.7 | 4.0.7 | 4.0.5 | 4.0.5 | 4.0.3 | 4.0.5 | — | — | — |
| postcss | 8.5.28 | 8.5.28 | 8.5.26 | 8.5.26 | 8.5.6 | 8.5.26 | 8.5.28 | 8.5.25 | 8.5.28 |
| rolldown | 1.2.8 | 1.2.7 | 1.2.4 | — | — | — | — | — | — |
| rollup | — | — | — | 4.63.3 | 4.54.0 | 4.63.3 | 4.62.4 | 4.62.3 | 4.63.1 |
| tinyglobby | 0.2.17 | 0.2.17 | 0.2.17 | 0.2.17 | 0.2.15 | 0.2.17 | — | — | — |
| fdir | — | — | — | 6.5.0 | 6.5.0 | 6.5.0 | — | — | — |
| lightningcss | 1.33.0 | 1.33.0 | 1.33.0 | — | — | — | — | — | — |
| vitest | — | — | 4.1.10 | — | — | — | — | — | — |
Ont bougé : 6 · identiques à chaque version : 3
Une arête indique qu'un résolveur a placé une version à côté d'une autre sur une machine réelle. Ce n'est pas une affirmation qu'elles fonctionnent ensemble ; à cette question répondent les échantillons et les contrats, pas la présence d'une ligne.
Clusters d'échecs récents
-
observé UNKNOWN exit 1 ERR_ASSERTION Lacune de preuve ×4 6.4.3 → 8.2.2 executionContext=node · os=linux · runtime=node@22.23 sha256:986d98189e70…node:internal/modules/run_main:<n> · triggerUncaughtException( · ^ · AssertionError [ERR_ASSERTION]: Expected values to be strictly equal:node · unclassified-diagnostic · outer node · gap stage-unknownQualité de preuve: complete · Variantes d’environnement: 2 · Premier relevé: 2026-09-04 · Dernière observation: 2026-09-05Candidat à une revérification diagnostique
-
observé PROJECT_TEST exit 1 ERR_LOAD_URL ×1 8.2.2 executionContext=node · moduleSystem=esm · os=linux · runtime=node@22.23 sha256:a60e7101af87…Contract test failed: Error: Failed to load custom Reporter from basic · at loadCustomReporterModule (fil<path>:<n>:<n>) · at fil<path>:<n>:<n> …javascript/test-runner · test-runner-diagnostic · outer npm testQualité de preuve: complete · Variantes d’environnement: 1 · Premier relevé: 2026-08-31 · Dernière observation: 2026-08-31
-
observé UNKNOWN exit 1 Lacune de preuve ×1 8.2.2 executionContext=node · moduleSystem=esm · os=linux · runtime=node@22.23 sha256:0ce61af3f1a8…<url>]:<n> · const res = await babelPlugin.transform.handler(code, <str>); · ^ · TypeError: Cannot read properties of undefined (reading <str>)node · unclassified-diagnostic · outer node · gap stage-unknownQualité de preuve: complete · Variantes d’environnement: 1 · Premier relevé: 2026-09-01 · Dernière observation: 2026-09-01Candidat à une revérification diagnostique
-
observé UNKNOWN exit 1 Lacune de preuve ×1 8.2.2 executionContext=node · moduleSystem=esm · os=linux · runtime=node@22.23 sha256:249ecd4b894f…fil<path>:<n> · skipFastRefresh = isProduction || config.command === <str> || config.server.hmr === false; · ^ …node · unclassified-diagnostic · outer node · gap stage-unknownQualité de preuve: complete · Variantes d’environnement: 1 · Premier relevé: 2026-09-01 · Dernière observation: 2026-09-01Candidat à une revérification diagnostique
-
observé UNKNOWN exit 1 Lacune de preuve ×1 8.2.2 executionContext=node · moduleSystem=esm · os=linux · runtime=node@22.23 sha256:8a6df6b44383…fil<path>:<n> · if (config.experimental.bundledDev) isBundledDev = true; · ^ · TypeError: Cannot read properties of undefined (reading <str>)node · unclassified-diagnostic · outer node · gap stage-unknownQualité de preuve: complete · Variantes d’environnement: 1 · Premier relevé: 2026-09-01 · Dernière observation: 2026-09-01Candidat à une revérification diagnostique
-
observé UNKNOWN exit 1 ERR_ASSERTION Lacune de preuve ×1 8.2.2 executionContext=node · moduleSystem=esm · os=linux · runtime=node@22.23 sha256:8b0e67a45c04…node:internal/modules/run_main:<n> · triggerUncaughtException( · ^ · AssertionError [ERR_ASSERTION]: resolves <path> to virtual module IDnode · unclassified-diagnostic · outer node · gap stage-unknownQualité de preuve: complete · Variantes d’environnement: 1 · Premier relevé: 2026-09-01 · Dernière observation: 2026-09-01Candidat à une revérification diagnostique
-
observé UNKNOWN exit 1 ERR_ASSERTION Lacune de preuve ×1 8.2.2 executionContext=node · moduleSystem=esm · os=linux · runtime=node@22.23 sha256:9088da2c451a…node:internal/modules/run_main:<n> · triggerUncaughtException( · ^ · AssertionError [ERR_ASSERTION]: load code contains RefreshRuntimenode · unclassified-diagnostic · outer node · gap stage-unknownQualité de preuve: complete · Variantes d’environnement: 1 · Premier relevé: 2026-09-01 · Dernière observation: 2026-09-01Candidat à une revérification diagnostique
-
observé UNKNOWN exit 1 Lacune de preuve ×1 8.2.2 executionContext=node · moduleSystem=esm · os=linux · runtime=node@22.23 sha256:aaa882de0091…fil<path>:<n> · const hooks = config.plugins.map((plugin) => plugin.api?.reactBabel).filter(defined); · ^ …node · unclassified-diagnostic · outer node · gap stage-unknownQualité de preuve: complete · Variantes d’environnement: 1 · Premier relevé: 2026-09-01 · Dernière observation: 2026-09-01Candidat à une revérification diagnostique
-
observé UNKNOWN exit 1 ERR_PACKAGE_PATH_NOT_EXPORTED Lacune de preuve ×1 8.2.2 executionContext=node · moduleSystem=esm · os=linux · runtime=node@22.23 sha256:b9a7518ba7bb…node:internal/modules/esm/resolve:<n> · return new ERR_PACKAGE_PATH_NOT_EXPORTED( · ^ …node · unclassified-diagnostic · outer node · gap stage-unknownQualité de preuve: complete · Variantes d’environnement: 1 · Premier relevé: 2026-09-01 · Dernière observation: 2026-09-01Candidat à une revérification diagnostique
-
observé UNKNOWN exit 1 ERR_PACKAGE_PATH_NOT_EXPORTED Lacune de preuve ×1 8.2.2 executionContext=node · moduleSystem=cjs · os=linux · runtime=node@22.23 sha256:e72340c7e3d4…node:internal/modules/cjs/loader:<n> · throw e; · ^ · Error [ERR_PACKAGE_PATH_NOT_EXPORTED]: Package subpath <str> is not defined by <str> in <path>node · unclassified-diagnostic · outer node · gap stage-unknownQualité de preuve: complete · Variantes d’environnement: 1 · Premier relevé: 2026-09-04 · Dernière observation: 2026-09-04Candidat à une revérification diagnostique