記録npmtypescript5.9.3
条件を変更
現在の条件
typescript @5.9.3windows 11 · x64 · node 24 · pnpm 10 · node
API ではなくパッケージ全体の合計
229 回中 0 回が成功
検証 — このネットワークがこの座標でコントラクトを実行しました。
サンプルあり — この座標で実行し、失敗した (5)
- プロジェクト観測
- 326 / 424
- コントラクト検証
- 0 / 229
- 使用記録
- 1,256
- 独立した報告ピア
- 1
- fingerprint を収集した失敗
- 95 / 98
- 最終記録
- 2026-09-26
開ける証拠
依存関係のヘルス
ある解決処理がこのリリースのツリーを読み、依存関係はありませんでした。欠落ではなく測定結果です。
最近の失敗クラスター
-
観測済み PROJECT_PROCESS ERR_ASSERTION 証拠の欠落 ×51 5.9.3 → 6.0.3 executionContext=node証拠品質: legacy-evidence-incomplete · 環境バリアント: 2 · 初回記録: 2026-08-23 · 最終観測: 2026-10-18診断再検証候補
-
観測済み UNKNOWN exit 1 ERR_PNPM_RECURSIVE_RUN_FIRST_FAIL 証拠の欠落 ×32 5.9.3 executionContext=node · moduleSystem=esm · os=windows · runtime=node@24.13 sha256:9f91c9753081…(node:<n>) ExperimentalWarning: SQLite is an experimental feature and might change at any time …pnpm · unclassified-diagnostic · outer pnpm · gap stage-unknown証拠品質: complete · 環境バリアント: 1 · 初回記録: 2026-09-01 · 最終観測: 2026-09-17診断再検証候補
-
観測済み UNKNOWN exit 1 ERR_PNPM_RECURSIVE_EXEC_FIRST_FAIL 証拠の欠落 ×28 5.9.3 executionContext=node · moduleSystem=esm · os=windows · runtime=node@24.13 sha256:979755e6489d…(node:<n>) ExperimentalWarning: SQLite is an experimental feature and might change at any time …pnpm · unclassified-diagnostic · outer pnpm · gap stage-unknown証拠品質: complete · 環境バリアント: 1 · 初回記録: 2026-09-01 · 最終観測: 2026-09-15診断再検証候補
-
観測済み UNKNOWN exit 1 ERR_ASSERTION 証拠の欠落 ×17 5.9.3 executionContext=node · moduleSystem=esm · os=windows · runtime=node@24.13 sha256:11c91a96bab4….................... · .................... · .................... · ....................node · unclassified-diagnostic · outer node · gap stage-unknown証拠品質: complete · 環境バリアント: 1 · 初回記録: 2026-10-18 · 最終観測: 2026-10-18診断再検証候補
-
観測済み PROJECT_TEST ELIFECYCLE 証拠の欠落 ×16 5.9.3 executionContext=node · os=windows · runtime=node@24.13証拠品質: legacy-evidence-incomplete · 環境バリアント: 4 · 初回記録: 2026-08-21 · 最終観測: 2026-09-26診断再検証候補
-
観測済み UNKNOWN exit 1 ERR_PNPM_RECURSIVE_EXEC_FIRST_FAIL 証拠の欠落 ×11 5.9.3 executionContext=node · moduleSystem=esm · os=windows · runtime=node@24.13 sha256:73873d2c4aed…<str> is not recognized as an internal or external command, · operable program or batch file. · undefined …pnpm · unclassified-diagnostic · outer pnpm · gap stage-unknown証拠品質: complete · 環境バリアント: 1 · 初回記録: 2026-09-01 · 最終観測: 2026-09-01診断再検証候補
-
観測済み PROJECT_TEST exit 1 ELIFECYCLE ×10 5.9.3 executionContext=node · moduleSystem=esm · os=windows · runtime=node@24.13 sha256:7711694d48fa…ELIFECYCLE Test failed. See above for more details.javascript/test-runner · test-runner-diagnostic · outer pnpm test証拠品質: complete · 環境バリアント: 1 · 初回記録: 2026-08-29 · 最終観測: 2026-09-01
-
観測済み PROJECT_COMPILE exit 2 TS2353 ×8 5.9.3 executionContext=node · moduleSystem=esm · os=windows · runtime=node@24.13 sha256:e862c3d7f7de…tests/deploy/pinned-foreign-release.test.ts(<n>,<n>): error TS2353: Object literal may only specify known properties, and <str> does not exist in type <str>. …typescript/tsc · compiler-diagnostic · outer node証拠品質: complete · 環境バリアント: 1 · 初回記録: 2026-10-18 · 最終観測: 2026-10-18
-
観測済み PROJECT_COMPILE exit 2 TS18046 ×8 5.9.3 executionContext=node · moduleSystem=esm · os=windows · runtime=node@24.13 sha256:f217c2ccf1b4…tests/deploy/pinned-foreign-release.test.ts(<n>,<n>): error TS18046: <str> is of type <str>. …typescript/tsc · compiler-diagnostic · outer node証拠品質: complete · 環境バリアント: 1 · 初回記録: 2026-10-18 · 最終観測: 2026-10-18
-
観測済み UNKNOWN exit 1 ELIFECYCLE 証拠の欠落 ×7 5.9.3 executionContext=node · moduleSystem=esm · os=windows · runtime=node@24.13 sha256:f398b989dbea…> devhotel-workspace@0.4.3 lint <path> · > eslint . · <path> …pnpm · unclassified-diagnostic · outer pnpm · gap stage-unknown証拠品質: complete · 環境バリアント: 1 · 初回記録: 2026-09-01 · 最終観測: 2026-09-01診断再検証候補
-
観測済み PROJECT_COMPILE exit 2 TS2339 ×7 5.9.3 executionContext=node · moduleSystem=esm · os=windows · runtime=node@24.13 sha256:a0e8c91c2c0f…tests/deploy/pinned-foreign-release.test.ts(<n>,<n>): error TS2339: Property <str> does not exist on type <str>.typescript/tsc · compiler-diagnostic · outer node証拠品質: complete · 環境バリアント: 1 · 初回記録: 2026-10-18 · 最終観測: 2026-10-18
-
観測済み PROJECT_COMPILE exit 2 TS2345 ×7 5.9.3 executionContext=node · moduleSystem=esm · os=windows · runtime=node@24.13 sha256:3424eb20377f…tests/deploy/pinned-foreign-release.test.ts(<n>,<n>): error TS2345: Argument of type <str> is not assignable to parameter of type <str>. …typescript/tsc · compiler-diagnostic · outer node証拠品質: complete · 環境バリアント: 1 · 初回記録: 2026-10-18 · 最終観測: 2026-10-18
最も多く報告された 12 件を表示しています。この座標に記録された失敗クラスタは 64 件です。残りは単発の報告です。