Recordsnpmtmp0.2.7
Change the conditions
Current conditions
tmp @0.2.7ubuntu glibc · x64 · node 22 · npm 10 · node
package-level total, not an API
0 of 11 passed
Verified — this network ran a contract at this coordinate.
there is a sample here, and our run of it at this coordinate failed (3)
- Project observations
- 38 / 38
- Contract verifications
- 0 / 11
- Usage records
- 7
- Independent reporting peers
- 3
- Last recorded
- 2026-09-07
Evidence you can open
Dependency Health
A resolution read this release's tree and found no dependencies. That is a measurement, not a missing one.
Recent failure clusters
-
observed UNKNOWN exit 1 Evidence gap ×1 0.2.7 executionContext=node · moduleSystem=esm · os=linux · runtime=node@22.23 sha256:795cbb5ee086…Error: Cannot find module <str> · Require stack: · - <path> · - <path>node · unclassified-diagnostic · outer node · gap stage-unknownEvidence quality: complete · Environment variants: 1 · First recorded: 2026-08-30 · Last seen: 2026-08-30Diagnostic re-verification candidate
-
observed UNKNOWN exit 1 ERR_ASSERTION Evidence gap ×1 0.2.7 executionContext=node · moduleSystem=cjs · os=linux · runtime=node@22.23 sha256:0d62cac8c07a…AssertionError [ERR_ASSERTION]: Expected values to be strictly equal: · + actual - expected · + <str> · - <str>node · unclassified-diagnostic · outer node · gap stage-unknownEvidence quality: complete · Environment variants: 1 · First recorded: 2026-08-30 · Last seen: 2026-08-30Diagnostic re-verification candidate
-
observed UNKNOWN exit 1 Evidence gap ×1 0.2.7 executionContext=node · moduleSystem=cjs · os=linux · runtime=node@22.23 sha256:e1d65fc7c136…<path>:<n> · throw new Error(`Unsupported arch ${name}`) · ^ · Error: Unsupported arch 1node · unclassified-diagnostic · outer node · gap stage-unknownEvidence quality: complete · Environment variants: 1 · First recorded: 2026-08-30 · Last seen: 2026-08-30Diagnostic re-verification candidate
-
observed UNKNOWN exit 1 Evidence gap ×1 0.2.7 executionContext=node · moduleSystem=cjs · os=linux · runtime=node@22.23 sha256:91ad26545eb1…node:internal/modules/cjs/loader:<n> · throw err; · ^ · Error: Cannot find module <str>node · unclassified-diagnostic · outer node · gap stage-unknownEvidence quality: complete · Environment variants: 1 · First recorded: 2026-08-31 · Last seen: 2026-08-31Diagnostic re-verification candidate
-
observed UNKNOWN exit 1 ERR_ASSERTION Evidence gap ×1 0.2.7 executionContext=node · moduleSystem=cjs · os=linux · runtime=node@22.23 sha256:ebb246f31650…AssertionError [ERR_ASSERTION]: async temporary file should be removed · true !== false · at <path>:<n>:<n> · at _fileCreated <path>:<n>:<n>)node · unclassified-diagnostic · outer node · gap stage-unknownEvidence quality: complete · Environment variants: 1 · First recorded: 2026-08-31 · Last seen: 2026-08-31Diagnostic re-verification candidate
-
observed UNKNOWN exit 1 ERR_ASSERTION Evidence gap ×1 0.2.7 executionContext=node · moduleSystem=esm · os=linux · runtime=node@22.23 sha256:b003339e9d09…Contract test failed: AssertionError [ERR_ASSERTION]: directory must be removed after cleanup · true !== false · at <url> · at _dirCreated <path>:<n>:<n>)node · unclassified-diagnostic · outer node · gap stage-unknownEvidence quality: complete · Environment variants: 1 · First recorded: 2026-09-01 · Last seen: 2026-09-01Diagnostic re-verification candidate
-
observed UNKNOWN exit 13 Evidence gap ×1 0.2.7 executionContext=node · moduleSystem=cjs · os=linux · runtime=node@22.23 sha256:3d1a8d5fc056…Warning: Detected unsettled top-level await at <url> · await new Promise((resolve, reject) => { · ^node · unclassified-diagnostic · outer node · gap stage-unknownEvidence quality: complete · Environment variants: 1 · First recorded: 2026-09-01 · Last seen: 2026-09-01Diagnostic re-verification candidate
-
observed UNKNOWN exit 1 Evidence gap ×1 0.2.7 executionContext=node · moduleSystem=cjs · os=linux · runtime=node@22.23 sha256:8c0fa39720fa…<url> · createTempFile, · ^^^^^^^^^^^^^^ …node · unclassified-diagnostic · outer node · gap stage-unknownEvidence quality: complete · Environment variants: 1 · First recorded: 2026-09-01 · Last seen: 2026-09-01Diagnostic re-verification candidate
-
observed UNKNOWN exit 1 ERR_ASSERTION Evidence gap ×1 0.2.7 executionContext=node · moduleSystem=cjs · os=linux · runtime=node@22.23 sha256:9b6d9cc2d8d3…node:internal/modules/run_main:<n> · triggerUncaughtException( · ^ · AssertionError [ERR_ASSERTION]: temporary file must be removed after cleanupnode · unclassified-diagnostic · outer node · gap stage-unknownEvidence quality: complete · Environment variants: 1 · First recorded: 2026-09-01 · Last seen: 2026-09-01Diagnostic re-verification candidate
-
observed UNKNOWN exit 1 ERR_ASSERTION Evidence gap ×1 0.2.7 executionContext=node · moduleSystem=cjs · os=linux · runtime=node@22.23 sha256:ee4d06f11a34…node:internal/modules/run_main:<n> · triggerUncaughtException( · ^ …node · unclassified-diagnostic · outer node · gap stage-unknownEvidence quality: complete · Environment variants: 1 · First recorded: 2026-09-01 · Last seen: 2026-09-01Diagnostic re-verification candidate
-
observed UNKNOWN exit 1 ERR_ASSERTION Evidence gap ×1 0.2.7 executionContext=node · moduleSystem=cjs · os=linux · runtime=node@22.23 sha256:07942c274189…node:internal/modules/run_main:<n> · triggerUncaughtException( · ^ · AssertionError [ERR_ASSERTION]: symlink must be creatednode · unclassified-diagnostic · outer node · gap stage-unknownEvidence quality: complete · Environment variants: 1 · First recorded: 2026-09-04 · Last seen: 2026-09-04Diagnostic re-verification candidate