記録npmtmp0.2.7tmp.tmpNameSync
条件を変更
依存関係のヘルス
ある解決処理がこのリリースのツリーを読み、依存関係はありませんでした。欠落ではなく測定結果です。
最近の失敗クラスター
-
観測済み UNKNOWN exit 1 証拠の欠落 ×2 0.2.7 executionContext=node · moduleSystem=cjs · os=linux · runtime=node@22.23 tmp.tmpNameSync sha256:91ad26545eb1…node:internal/modules/cjs/loader:<n> · throw err; · ^ · Error: Cannot find module <str>node · unclassified-diagnostic · outer node · gap stage-unknown証拠品質: complete · 環境バリアント: 1 · 初回記録: 2026-08-31 · 最終観測: 2026-08-31診断再検証候補
-
観測済み UNKNOWN exit 1 ERR_ASSERTION 証拠の欠落 ×2 0.2.7 executionContext=node · moduleSystem=cjs · os=linux · runtime=node@22.23 tmp.tmpNameSync sha256:ebb246f31650…AssertionError [ERR_ASSERTION]: async temporary file should be removed · true !== false · at <path>:<n>:<n> · at _fileCreated <path>:<n>:<n>)node · unclassified-diagnostic · outer node · gap stage-unknown証拠品質: complete · 環境バリアント: 1 · 初回記録: 2026-08-31 · 最終観測: 2026-08-31診断再検証候補
-
観測済み UNKNOWN exit 1 証拠の欠落 ×1 0.2.7 executionContext=node · moduleSystem=esm · os=linux · runtime=node@22.23 sha256:795cbb5ee086…Error: Cannot find module <str> · Require stack: · - <path> · - <path>node · unclassified-diagnostic · outer node · gap stage-unknown証拠品質: complete · 環境バリアント: 1 · 初回記録: 2026-08-30 · 最終観測: 2026-08-30診断再検証候補
-
観測済み UNKNOWN exit 1 ERR_ASSERTION 証拠の欠落 ×1 0.2.7 executionContext=node · moduleSystem=cjs · os=linux · runtime=node@22.23 sha256:0d62cac8c07a…AssertionError [ERR_ASSERTION]: Expected values to be strictly equal: · + actual - expected · + <str> · - <str>node · unclassified-diagnostic · outer node · gap stage-unknown証拠品質: complete · 環境バリアント: 1 · 初回記録: 2026-08-30 · 最終観測: 2026-08-30診断再検証候補
-
観測済み UNKNOWN exit 1 証拠の欠落 ×1 0.2.7 executionContext=node · moduleSystem=cjs · os=linux · runtime=node@22.23 sha256:e1d65fc7c136…<path>:<n> · throw new Error(`Unsupported arch ${name}`) · ^ · Error: Unsupported arch 1node · unclassified-diagnostic · outer node · gap stage-unknown証拠品質: complete · 環境バリアント: 1 · 初回記録: 2026-08-30 · 最終観測: 2026-08-30診断再検証候補
-
観測済み UNKNOWN exit 1 ERR_ASSERTION 証拠の欠落 ×1 0.2.7 executionContext=node · moduleSystem=esm · os=linux · runtime=node@22.23 sha256:b003339e9d09…Contract test failed: AssertionError [ERR_ASSERTION]: directory must be removed after cleanup · true !== false · at <url> · at _dirCreated <path>:<n>:<n>)node · unclassified-diagnostic · outer node · gap stage-unknown証拠品質: complete · 環境バリアント: 1 · 初回記録: 2026-09-01 · 最終観測: 2026-09-01診断再検証候補
-
観測済み UNKNOWN exit 13 証拠の欠落 ×1 0.2.7 executionContext=node · moduleSystem=cjs · os=linux · runtime=node@22.23 sha256:3d1a8d5fc056…Warning: Detected unsettled top-level await at <url> · await new Promise((resolve, reject) => { · ^node · unclassified-diagnostic · outer node · gap stage-unknown証拠品質: complete · 環境バリアント: 1 · 初回記録: 2026-09-01 · 最終観測: 2026-09-01診断再検証候補
-
観測済み UNKNOWN exit 1 証拠の欠落 ×1 0.2.7 executionContext=node · moduleSystem=cjs · os=linux · runtime=node@22.23 sha256:8c0fa39720fa…<url> · createTempFile, · ^^^^^^^^^^^^^^ …node · unclassified-diagnostic · outer node · gap stage-unknown証拠品質: complete · 環境バリアント: 1 · 初回記録: 2026-09-01 · 最終観測: 2026-09-01診断再検証候補
-
観測済み UNKNOWN exit 1 ERR_ASSERTION 証拠の欠落 ×1 0.2.7 executionContext=node · moduleSystem=cjs · os=linux · runtime=node@22.23 sha256:9b6d9cc2d8d3…node:internal/modules/run_main:<n> · triggerUncaughtException( · ^ · AssertionError [ERR_ASSERTION]: temporary file must be removed after cleanupnode · unclassified-diagnostic · outer node · gap stage-unknown証拠品質: complete · 環境バリアント: 1 · 初回記録: 2026-09-01 · 最終観測: 2026-09-01診断再検証候補
-
観測済み UNKNOWN exit 1 ERR_ASSERTION 証拠の欠落 ×1 0.2.7 executionContext=node · moduleSystem=cjs · os=linux · runtime=node@22.23 sha256:ee4d06f11a34…node:internal/modules/run_main:<n> · triggerUncaughtException( · ^ …node · unclassified-diagnostic · outer node · gap stage-unknown証拠品質: complete · 環境バリアント: 1 · 初回記録: 2026-09-01 · 最終観測: 2026-09-01診断再検証候補
-
観測済み UNKNOWN exit 1 ERR_ASSERTION 証拠の欠落 ×1 0.2.7 executionContext=node · moduleSystem=cjs · os=linux · runtime=node@22.23 sha256:07942c274189…node:internal/modules/run_main:<n> · triggerUncaughtException( · ^ · AssertionError [ERR_ASSERTION]: symlink must be creatednode · unclassified-diagnostic · outer node · gap stage-unknown証拠品質: complete · 環境バリアント: 1 · 初回記録: 2026-09-04 · 最終観測: 2026-09-04診断再検証候補