记录npmtmp0.2.7tmp.dir
更改条件
依赖健康度
某次解析读取了该版本的依赖树,没有发现依赖。这是一次测量结果,而不是缺失。
近期失败聚类
-
已观测 UNKNOWN exit 1 证据缺口 ×2 0.2.7 executionContext=node · moduleSystem=cjs · os=linux · runtime=node@22.23 tmp.dir sha256:91ad26545eb1…node:internal/modules/cjs/loader:<n> · throw err; · ^ · Error: Cannot find module <str>node · unclassified-diagnostic · outer node · gap stage-unknown证据质量: complete · 环境变体: 1 · 首次记录: 2026-08-31 · 最近观测: 2026-08-31诊断复验候选
-
已观测 UNKNOWN exit 1 ERR_ASSERTION 证据缺口 ×2 0.2.7 executionContext=node · moduleSystem=cjs · os=linux · runtime=node@22.23 tmp.dir sha256:ebb246f31650…AssertionError [ERR_ASSERTION]: async temporary file should be removed · true !== false · at <path>:<n>:<n> · at _fileCreated <path>:<n>:<n>)node · unclassified-diagnostic · outer node · gap stage-unknown证据质量: complete · 环境变体: 1 · 首次记录: 2026-08-31 · 最近观测: 2026-08-31诊断复验候选
-
已观测 UNKNOWN exit 1 ERR_ASSERTION 证据缺口 ×2 0.2.7 executionContext=node · moduleSystem=esm · os=linux · runtime=node@22.23 tmp.dir sha256:b003339e9d09…Contract test failed: AssertionError [ERR_ASSERTION]: directory must be removed after cleanup · true !== false · at <url> · at _dirCreated <path>:<n>:<n>)node · unclassified-diagnostic · outer node · gap stage-unknown证据质量: complete · 环境变体: 1 · 首次记录: 2026-09-01 · 最近观测: 2026-09-01诊断复验候选
-
已观测 UNKNOWN exit 1 证据缺口 ×1 0.2.7 executionContext=node · moduleSystem=esm · os=linux · runtime=node@22.23 sha256:795cbb5ee086…Error: Cannot find module <str> · Require stack: · - <path> · - <path>node · unclassified-diagnostic · outer node · gap stage-unknown证据质量: complete · 环境变体: 1 · 首次记录: 2026-08-30 · 最近观测: 2026-08-30诊断复验候选
-
已观测 UNKNOWN exit 1 ERR_ASSERTION 证据缺口 ×1 0.2.7 executionContext=node · moduleSystem=cjs · os=linux · runtime=node@22.23 sha256:0d62cac8c07a…AssertionError [ERR_ASSERTION]: Expected values to be strictly equal: · + actual - expected · + <str> · - <str>node · unclassified-diagnostic · outer node · gap stage-unknown证据质量: complete · 环境变体: 1 · 首次记录: 2026-08-30 · 最近观测: 2026-08-30诊断复验候选
-
已观测 UNKNOWN exit 1 证据缺口 ×1 0.2.7 executionContext=node · moduleSystem=cjs · os=linux · runtime=node@22.23 sha256:e1d65fc7c136…<path>:<n> · throw new Error(`Unsupported arch ${name}`) · ^ · Error: Unsupported arch 1node · unclassified-diagnostic · outer node · gap stage-unknown证据质量: complete · 环境变体: 1 · 首次记录: 2026-08-30 · 最近观测: 2026-08-30诊断复验候选
-
已观测 UNKNOWN exit 13 证据缺口 ×1 0.2.7 executionContext=node · moduleSystem=cjs · os=linux · runtime=node@22.23 sha256:3d1a8d5fc056…Warning: Detected unsettled top-level await at <url> · await new Promise((resolve, reject) => { · ^node · unclassified-diagnostic · outer node · gap stage-unknown证据质量: complete · 环境变体: 1 · 首次记录: 2026-09-01 · 最近观测: 2026-09-01诊断复验候选
-
已观测 UNKNOWN exit 1 证据缺口 ×1 0.2.7 executionContext=node · moduleSystem=cjs · os=linux · runtime=node@22.23 sha256:8c0fa39720fa…<url> · createTempFile, · ^^^^^^^^^^^^^^ …node · unclassified-diagnostic · outer node · gap stage-unknown证据质量: complete · 环境变体: 1 · 首次记录: 2026-09-01 · 最近观测: 2026-09-01诊断复验候选
-
已观测 UNKNOWN exit 1 ERR_ASSERTION 证据缺口 ×1 0.2.7 executionContext=node · moduleSystem=cjs · os=linux · runtime=node@22.23 sha256:9b6d9cc2d8d3…node:internal/modules/run_main:<n> · triggerUncaughtException( · ^ · AssertionError [ERR_ASSERTION]: temporary file must be removed after cleanupnode · unclassified-diagnostic · outer node · gap stage-unknown证据质量: complete · 环境变体: 1 · 首次记录: 2026-09-01 · 最近观测: 2026-09-01诊断复验候选
-
已观测 UNKNOWN exit 1 ERR_ASSERTION 证据缺口 ×1 0.2.7 executionContext=node · moduleSystem=cjs · os=linux · runtime=node@22.23 sha256:ee4d06f11a34…node:internal/modules/run_main:<n> · triggerUncaughtException( · ^ …node · unclassified-diagnostic · outer node · gap stage-unknown证据质量: complete · 环境变体: 1 · 首次记录: 2026-09-01 · 最近观测: 2026-09-01诊断复验候选
-
已观测 UNKNOWN exit 1 ERR_ASSERTION 证据缺口 ×1 0.2.7 executionContext=node · moduleSystem=cjs · os=linux · runtime=node@22.23 sha256:07942c274189…node:internal/modules/run_main:<n> · triggerUncaughtException( · ^ · AssertionError [ERR_ASSERTION]: symlink must be creatednode · unclassified-diagnostic · outer node · gap stage-unknown证据质量: complete · 环境变体: 1 · 首次记录: 2026-09-04 · 最近观测: 2026-09-04诊断复验候选