기록npmtmp0.2.7tmp.tmpNameSync
조건 변경
현재 조건
tmp.tmpNameSync @0.2.7ubuntu glibc · x64 · node 22 · npm 10 · node
4회 중 0회 통과
검증 — 이 네트워크가 이 좌표에서 컨트랙트를 직접 실행했습니다.
샘플 있음 — 이 좌표에서 우리가 실행했고 실패함
- 프로젝트 관측
- 8 / 8
- 컨트랙트 검증
- 0 / 4
- 독립 보고 peer
- 2
- 마지막 기록
- 2026-08-31
열어 볼 수 있는 증거
의존성 건강도
어떤 해결 과정이 이 릴리스의 트리를 읽었고 의존성이 없었습니다. 빠진 것이 아니라 측정된 것입니다.
최근 실패 클러스터
-
관측됨 UNKNOWN exit 1 증거 공백 ×2 0.2.7 executionContext=node · moduleSystem=cjs · os=linux · runtime=node@22.23 tmp.tmpNameSync sha256:91ad26545eb1…node:internal/modules/cjs/loader:<n> · throw err; · ^ · Error: Cannot find module <str>node · unclassified-diagnostic · outer node · gap stage-unknown증거 품질: complete · 환경 변형: 1 · 최초 관측: 2026-08-31 · 마지막 관측: 2026-08-31진단 재검증 후보
-
관측됨 UNKNOWN exit 1 ERR_ASSERTION 증거 공백 ×2 0.2.7 executionContext=node · moduleSystem=cjs · os=linux · runtime=node@22.23 tmp.tmpNameSync sha256:ebb246f31650…AssertionError [ERR_ASSERTION]: async temporary file should be removed · true !== false · at <path>:<n>:<n> · at _fileCreated <path>:<n>:<n>)node · unclassified-diagnostic · outer node · gap stage-unknown증거 품질: complete · 환경 변형: 1 · 최초 관측: 2026-08-31 · 마지막 관측: 2026-08-31진단 재검증 후보
-
관측됨 UNKNOWN exit 1 증거 공백 ×1 0.2.7 executionContext=node · moduleSystem=esm · os=linux · runtime=node@22.23 sha256:795cbb5ee086…Error: Cannot find module <str> · Require stack: · - <path> · - <path>node · unclassified-diagnostic · outer node · gap stage-unknown증거 품질: complete · 환경 변형: 1 · 최초 관측: 2026-08-30 · 마지막 관측: 2026-08-30진단 재검증 후보
-
관측됨 UNKNOWN exit 1 ERR_ASSERTION 증거 공백 ×1 0.2.7 executionContext=node · moduleSystem=cjs · os=linux · runtime=node@22.23 sha256:0d62cac8c07a…AssertionError [ERR_ASSERTION]: Expected values to be strictly equal: · + actual - expected · + <str> · - <str>node · unclassified-diagnostic · outer node · gap stage-unknown증거 품질: complete · 환경 변형: 1 · 최초 관측: 2026-08-30 · 마지막 관측: 2026-08-30진단 재검증 후보
-
관측됨 UNKNOWN exit 1 증거 공백 ×1 0.2.7 executionContext=node · moduleSystem=cjs · os=linux · runtime=node@22.23 sha256:e1d65fc7c136…<path>:<n> · throw new Error(`Unsupported arch ${name}`) · ^ · Error: Unsupported arch 1node · unclassified-diagnostic · outer node · gap stage-unknown증거 품질: complete · 환경 변형: 1 · 최초 관측: 2026-08-30 · 마지막 관측: 2026-08-30진단 재검증 후보
-
관측됨 UNKNOWN exit 1 ERR_ASSERTION 증거 공백 ×1 0.2.7 executionContext=node · moduleSystem=esm · os=linux · runtime=node@22.23 sha256:b003339e9d09…Contract test failed: AssertionError [ERR_ASSERTION]: directory must be removed after cleanup · true !== false · at <url> · at _dirCreated <path>:<n>:<n>)node · unclassified-diagnostic · outer node · gap stage-unknown증거 품질: complete · 환경 변형: 1 · 최초 관측: 2026-09-01 · 마지막 관측: 2026-09-01진단 재검증 후보
-
관측됨 UNKNOWN exit 13 증거 공백 ×1 0.2.7 executionContext=node · moduleSystem=cjs · os=linux · runtime=node@22.23 sha256:3d1a8d5fc056…Warning: Detected unsettled top-level await at <url> · await new Promise((resolve, reject) => { · ^node · unclassified-diagnostic · outer node · gap stage-unknown증거 품질: complete · 환경 변형: 1 · 최초 관측: 2026-09-01 · 마지막 관측: 2026-09-01진단 재검증 후보
-
관측됨 UNKNOWN exit 1 증거 공백 ×1 0.2.7 executionContext=node · moduleSystem=cjs · os=linux · runtime=node@22.23 sha256:8c0fa39720fa…<url> · createTempFile, · ^^^^^^^^^^^^^^ …node · unclassified-diagnostic · outer node · gap stage-unknown증거 품질: complete · 환경 변형: 1 · 최초 관측: 2026-09-01 · 마지막 관측: 2026-09-01진단 재검증 후보
-
관측됨 UNKNOWN exit 1 ERR_ASSERTION 증거 공백 ×1 0.2.7 executionContext=node · moduleSystem=cjs · os=linux · runtime=node@22.23 sha256:9b6d9cc2d8d3…node:internal/modules/run_main:<n> · triggerUncaughtException( · ^ · AssertionError [ERR_ASSERTION]: temporary file must be removed after cleanupnode · unclassified-diagnostic · outer node · gap stage-unknown증거 품질: complete · 환경 변형: 1 · 최초 관측: 2026-09-01 · 마지막 관측: 2026-09-01진단 재검증 후보
-
관측됨 UNKNOWN exit 1 ERR_ASSERTION 증거 공백 ×1 0.2.7 executionContext=node · moduleSystem=cjs · os=linux · runtime=node@22.23 sha256:ee4d06f11a34…node:internal/modules/run_main:<n> · triggerUncaughtException( · ^ …node · unclassified-diagnostic · outer node · gap stage-unknown증거 품질: complete · 환경 변형: 1 · 최초 관측: 2026-09-01 · 마지막 관측: 2026-09-01진단 재검증 후보
-
관측됨 UNKNOWN exit 1 ERR_ASSERTION 증거 공백 ×1 0.2.7 executionContext=node · moduleSystem=cjs · os=linux · runtime=node@22.23 sha256:07942c274189…node:internal/modules/run_main:<n> · triggerUncaughtException( · ^ · AssertionError [ERR_ASSERTION]: symlink must be creatednode · unclassified-diagnostic · outer node · gap stage-unknown증거 품질: complete · 환경 변형: 1 · 최초 관측: 2026-09-04 · 마지막 관측: 2026-09-04진단 재검증 후보