Registrosnpmtinyspy3.0.2tinyspy.spyOn
Cambiar las condiciones
Condiciones actuales
tinyspy.spyOn @3.0.2debian glibc · x64 · node 22 · npm · node
1 de 1 pasaron
Verificado: esta red ejecutó un contrato en esta coordenada.
hay una muestra aquí y nuestra ejecución en esta coordenada terminó limpia (2)
- Observaciones de proyectos
- 1 / 1
- Verificaciones de contrato
- 1 / 1
- Peers independientes que reportaron
- 1
- Último registro
- 2026-09-17
Evidencia que puedes abrir
Salud de dependencias
Una resolución leyó el árbol de esta versión y no encontró dependencias. Es una medición, no una que falte.
Clústeres de fallos recientes
-
observado PROCESS_START process start failed Brecha de evidencia ×14 3.0.2 → 4.0.4 → 4.0.6 executionContext=node sha256:c12549970456…· structured-termination · gap diagnostic-missingCalidad de evidencia: partial · Variantes de entorno: 3 · Primer registro: 2026-08-31 · Última observación: 2026-09-16Candidato a reverificación diagnóstica
-
observado UNKNOWN exit 1 Brecha de evidencia ×3 3.0.2 executionContext=node · moduleSystem=esm · os=linux · runtime=node@22.23 sha256:8fd30f2a6304…fil<path>:<n> · throw new Error(errorMsg); · ^ · Error: Vitest failed to access its internal state.node · unclassified-diagnostic · outer node · gap stage-unknownCalidad de evidencia: complete · Variantes de entorno: 1 · Primer registro: 2026-08-31 · Última observación: 2026-09-08Candidato a reverificación diagnóstica
-
observado UNKNOWN exit 1 Brecha de evidencia ×2 3.0.2 executionContext=node · moduleSystem=esm · os=linux · runtime=node@22.23 sha256:42623a56826f…fil<path>:<n> · Object.defineProperty(expect.not, expectAssertionName, { · ^ · TypeError: Object.defineProperty called on non-objectnode · unclassified-diagnostic · outer node · gap stage-unknownCalidad de evidencia: complete · Variantes de entorno: 1 · Primer registro: 2026-09-03 · Última observación: 2026-09-04Candidato a reverificación diagnóstica
-
observado UNKNOWN exit 1 Brecha de evidencia ×2 3.0.2 executionContext=node · moduleSystem=cjs · os=linux · runtime=node@22.23 sha256:3b3190f2cd44…doc: cannot find package <str> in any of: · ($GOROOT not set) · <path> (from $GOPATH)go · unclassified-diagnostic · outer go · gap stage-unknownCalidad de evidencia: complete · Variantes de entorno: 1 · Primer registro: 2026-09-04 · Última observación: 2026-09-04Candidato a reverificación diagnóstica
-
observado UNKNOWN exit 1 Brecha de evidencia ×2 3.0.2 executionContext=node · moduleSystem=cjs · os=linux · runtime=node@22.23 sha256:f0288eb0529f…Traceback (most recent call last): · File <str>, line 19, in <module> · AssertionError· unclassified-diagnostic · gap stage-unknownCalidad de evidencia: complete · Variantes de entorno: 1 · Primer registro: 2026-09-04 · Última observación: 2026-09-04Candidato a reverificación diagnóstica
-
observado UNKNOWN exit 1 Brecha de evidencia ×1 3.0.2 executionContext=node · moduleSystem=cjs · os=linux · runtime=node@22.23 sha256:72ba2d1e946f…<path>: No module named pippython3 · unclassified-diagnostic · outer python3 · gap stage-unknownCalidad de evidencia: complete · Variantes de entorno: 1 · Primer registro: 2026-08-31 · Última observación: 2026-08-31Candidato a reverificación diagnóstica
-
observado UNKNOWN exit 1 Brecha de evidencia ×1 3.0.2 executionContext=node · moduleSystem=cjs · os=linux · runtime=node@22.23 sha256:91ad26545eb1…node:internal/modules/cjs/loader:<n> · throw err; · ^ · Error: Cannot find module <str>node · unclassified-diagnostic · outer node · gap stage-unknownCalidad de evidencia: complete · Variantes de entorno: 1 · Primer registro: 2026-08-31 · Última observación: 2026-08-31Candidato a reverificación diagnóstica
-
observado UNKNOWN exit 1 Brecha de evidencia ×1 3.0.2 executionContext=node · moduleSystem=cjs · os=linux · runtime=node@22.23 sha256:d7f5d491441c…Traceback (most recent call last): · File <str>, line 71, in <module> · AssertionError: is_annotated must return True for Annotated· unclassified-diagnostic · gap stage-unknownCalidad de evidencia: complete · Variantes de entorno: 1 · Primer registro: 2026-08-31 · Última observación: 2026-08-31Candidato a reverificación diagnóstica
-
observado UNKNOWN exit 1 Brecha de evidencia ×1 3.0.2 executionContext=node · moduleSystem=esm · os=linux · runtime=node@22.23 sha256:67b21c7b2753…Contract test failed: TypeError: Cannot assign to read only property <str> of function 'class Assertion { · constructor(obj) { · this._obj = obj; · }node · unclassified-diagnostic · outer node · gap stage-unknownCalidad de evidencia: complete · Variantes de entorno: 1 · Primer registro: 2026-09-03 · Última observación: 2026-09-03Candidato a reverificación diagnóstica
-
observado UNKNOWN exit 1 Brecha de evidencia ×1 3.0.2 executionContext=node · moduleSystem=esm · os=linux · runtime=node@22.23 sha256:db4b73d5113b…Contract test failed: TypeError: utils.addProperty is not a function · at JestChaiExpect (fil<path>:<n>:<n>) · at Object.use (<url>) …node · unclassified-diagnostic · outer node · gap stage-unknownCalidad de evidencia: complete · Variantes de entorno: 1 · Primer registro: 2026-09-03 · Última observación: 2026-09-03Candidato a reverificación diagnóstica
-
observado UNKNOWN exit 1 ERR_MODULE_NOT_FOUND Brecha de evidencia ×1 3.0.2 executionContext=node · moduleSystem=cjs · os=linux · runtime=node@22.23 sha256:88af852f99a8…node:internal/modules/package_json_reader:<n> · throw new ERR_MODULE_NOT_FOUND(packageName, fileURLToPath(base), null); · ^ …node · unclassified-diagnostic · outer node · gap stage-unknownCalidad de evidencia: complete · Variantes de entorno: 1 · Primer registro: 2026-09-04 · Última observación: 2026-09-04Candidato a reverificación diagnóstica
-
observado UNKNOWN signal KILLED Brecha de evidencia ×1 3.0.2 executionContext=node · moduleSystem=cjs · os=linux · runtime=node@22.23 sha256:c0d19b91db75…· unclassified-diagnostic · gap diagnostic-missingCalidad de evidencia: partial · Variantes de entorno: 1 · Primer registro: 2026-09-04 · Última observación: 2026-09-04Candidato a reverificación diagnóstica
Se muestran los 12 más reportados de 18 grupos de fallos registrados. El resto son reportes únicos.