Aufzeichnungennpmtinyspy3.0.2spy
Bedingungen ändern
Aktuelle Bedingungen
spy @3.0.2debian glibc · x64 · node 22 · npm · node
1 von 1 bestanden
Beobachtet — echte Projekt-Builds haben von dieser Koordinate berichtet.
hier gibt es ein Sample, und wir haben es an dieser Koordinate noch nicht ausgeführt (2)
- Projektbeobachtungen
- 1 / 1
- Contract-Verifikationen
- nichts an dieser Koordinate
- Unabhängig meldende Peers
- 1
- Zuletzt erfasst
- 2026-09-17
Nachweise zum Öffnen
Abhängigkeits-Zustand
Eine Auflösung hat den Baum dieses Releases gelesen und keine Abhängigkeiten gefunden. Das ist eine Messung, keine fehlende.
Aktuelle Fehler-Cluster
-
beobachtet PROCESS_START process start failed Beweislücke ×14 3.0.2 → 4.0.4 → 4.0.6 executionContext=node sha256:c12549970456…· structured-termination · gap diagnostic-missingBeweisqualität: partial · Umgebungsvarianten: 3 · Zuerst erfasst: 2026-08-31 · Zuletzt gesehen: 2026-09-16Kandidat für diagnostische Neuprüfung
-
beobachtet UNKNOWN exit 1 Beweislücke ×3 3.0.2 executionContext=node · moduleSystem=esm · os=linux · runtime=node@22.23 sha256:8fd30f2a6304…fil<path>:<n> · throw new Error(errorMsg); · ^ · Error: Vitest failed to access its internal state.node · unclassified-diagnostic · outer node · gap stage-unknownBeweisqualität: complete · Umgebungsvarianten: 1 · Zuerst erfasst: 2026-08-31 · Zuletzt gesehen: 2026-09-08Kandidat für diagnostische Neuprüfung
-
beobachtet UNKNOWN exit 1 Beweislücke ×2 3.0.2 executionContext=node · moduleSystem=esm · os=linux · runtime=node@22.23 sha256:42623a56826f…fil<path>:<n> · Object.defineProperty(expect.not, expectAssertionName, { · ^ · TypeError: Object.defineProperty called on non-objectnode · unclassified-diagnostic · outer node · gap stage-unknownBeweisqualität: complete · Umgebungsvarianten: 1 · Zuerst erfasst: 2026-09-03 · Zuletzt gesehen: 2026-09-04Kandidat für diagnostische Neuprüfung
-
beobachtet UNKNOWN exit 1 Beweislücke ×2 3.0.2 executionContext=node · moduleSystem=cjs · os=linux · runtime=node@22.23 sha256:3b3190f2cd44…doc: cannot find package <str> in any of: · ($GOROOT not set) · <path> (from $GOPATH)go · unclassified-diagnostic · outer go · gap stage-unknownBeweisqualität: complete · Umgebungsvarianten: 1 · Zuerst erfasst: 2026-09-04 · Zuletzt gesehen: 2026-09-04Kandidat für diagnostische Neuprüfung
-
beobachtet UNKNOWN exit 1 Beweislücke ×2 3.0.2 executionContext=node · moduleSystem=cjs · os=linux · runtime=node@22.23 sha256:f0288eb0529f…Traceback (most recent call last): · File <str>, line 19, in <module> · AssertionError· unclassified-diagnostic · gap stage-unknownBeweisqualität: complete · Umgebungsvarianten: 1 · Zuerst erfasst: 2026-09-04 · Zuletzt gesehen: 2026-09-04Kandidat für diagnostische Neuprüfung
-
beobachtet UNKNOWN exit 1 Beweislücke ×1 3.0.2 executionContext=node · moduleSystem=cjs · os=linux · runtime=node@22.23 sha256:72ba2d1e946f…<path>: No module named pippython3 · unclassified-diagnostic · outer python3 · gap stage-unknownBeweisqualität: complete · Umgebungsvarianten: 1 · Zuerst erfasst: 2026-08-31 · Zuletzt gesehen: 2026-08-31Kandidat für diagnostische Neuprüfung
-
beobachtet UNKNOWN exit 1 Beweislücke ×1 3.0.2 executionContext=node · moduleSystem=cjs · os=linux · runtime=node@22.23 sha256:91ad26545eb1…node:internal/modules/cjs/loader:<n> · throw err; · ^ · Error: Cannot find module <str>node · unclassified-diagnostic · outer node · gap stage-unknownBeweisqualität: complete · Umgebungsvarianten: 1 · Zuerst erfasst: 2026-08-31 · Zuletzt gesehen: 2026-08-31Kandidat für diagnostische Neuprüfung
-
beobachtet UNKNOWN exit 1 Beweislücke ×1 3.0.2 executionContext=node · moduleSystem=cjs · os=linux · runtime=node@22.23 sha256:d7f5d491441c…Traceback (most recent call last): · File <str>, line 71, in <module> · AssertionError: is_annotated must return True for Annotated· unclassified-diagnostic · gap stage-unknownBeweisqualität: complete · Umgebungsvarianten: 1 · Zuerst erfasst: 2026-08-31 · Zuletzt gesehen: 2026-08-31Kandidat für diagnostische Neuprüfung
-
beobachtet UNKNOWN exit 1 Beweislücke ×1 3.0.2 executionContext=node · moduleSystem=esm · os=linux · runtime=node@22.23 sha256:67b21c7b2753…Contract test failed: TypeError: Cannot assign to read only property <str> of function 'class Assertion { · constructor(obj) { · this._obj = obj; · }node · unclassified-diagnostic · outer node · gap stage-unknownBeweisqualität: complete · Umgebungsvarianten: 1 · Zuerst erfasst: 2026-09-03 · Zuletzt gesehen: 2026-09-03Kandidat für diagnostische Neuprüfung
-
beobachtet UNKNOWN exit 1 Beweislücke ×1 3.0.2 executionContext=node · moduleSystem=esm · os=linux · runtime=node@22.23 sha256:db4b73d5113b…Contract test failed: TypeError: utils.addProperty is not a function · at JestChaiExpect (fil<path>:<n>:<n>) · at Object.use (<url>) …node · unclassified-diagnostic · outer node · gap stage-unknownBeweisqualität: complete · Umgebungsvarianten: 1 · Zuerst erfasst: 2026-09-03 · Zuletzt gesehen: 2026-09-03Kandidat für diagnostische Neuprüfung
-
beobachtet UNKNOWN exit 1 ERR_MODULE_NOT_FOUND Beweislücke ×1 3.0.2 executionContext=node · moduleSystem=cjs · os=linux · runtime=node@22.23 sha256:88af852f99a8…node:internal/modules/package_json_reader:<n> · throw new ERR_MODULE_NOT_FOUND(packageName, fileURLToPath(base), null); · ^ …node · unclassified-diagnostic · outer node · gap stage-unknownBeweisqualität: complete · Umgebungsvarianten: 1 · Zuerst erfasst: 2026-09-04 · Zuletzt gesehen: 2026-09-04Kandidat für diagnostische Neuprüfung
-
beobachtet UNKNOWN signal KILLED Beweislücke ×1 3.0.2 executionContext=node · moduleSystem=cjs · os=linux · runtime=node@22.23 sha256:c0d19b91db75…· unclassified-diagnostic · gap diagnostic-missingBeweisqualität: partial · Umgebungsvarianten: 1 · Zuerst erfasst: 2026-09-04 · Zuletzt gesehen: 2026-09-04Kandidat für diagnostische Neuprüfung
Es werden die 12 meistgemeldeten von 18 aufgezeichneten Fehlerclustern gezeigt. Der Rest sind Einzelmeldungen.