記録npmtinyrainbow3.1.1tinyrainbow.disableDefaultColors
条件を変更
依存関係のヘルス
ある解決処理がこのリリースのツリーを読み、依存関係はありませんでした。欠落ではなく測定結果です。
最近の失敗クラスター
-
観測済み UNKNOWN exit 1 ERR_ASSERTION 証拠の欠落 ×12 1.2.0 → 2.0.0 → 3.1.1 executionContext=node · os=linux · runtime=node@22.23 sha256:986d98189e70…node:internal/modules/run_main:<n> · triggerUncaughtException( · ^ · AssertionError [ERR_ASSERTION]: Expected values to be strictly equal:node · unclassified-diagnostic · outer node · gap stage-unknown証拠品質: complete · 環境バリアント: 2 · 初回記録: 2026-08-30 · 最終観測: 2026-09-06診断再検証候補
-
観測済み PROJECT_PROCESS ERR_MODULE_NOT_FOUND 証拠の欠落 ×9 2.0.0 → 3.1.1 executionContext=node証拠品質: legacy-evidence-incomplete · 環境バリアント: 3 · 初回記録: 2026-08-14 · 最終観測: 2026-08-30診断再検証候補
-
観測済み UNKNOWN exit 1 ERR_MODULE_NOT_FOUND 証拠の欠落 ×4 1.2.0 → 2.0.0 → 3.1.1 executionContext=node · os=linux · runtime=node@22.23 sha256:88af852f99a8…node:internal/modules/package_json_reader:<n> · throw new ERR_MODULE_NOT_FOUND(packageName, fileURLToPath(base), null); · ^ …node · unclassified-diagnostic · outer node · gap stage-unknown証拠品質: complete · 環境バリアント: 2 · 初回記録: 2026-08-31 · 最終観測: 2026-09-06診断再検証候補
-
観測済み PROJECT_TEST exit 1 ERR_ASSERTION ×1 3.1.1 executionContext=node · moduleSystem=esm · os=linux · runtime=node@22.23 sha256:09efc419ec36…AssertionError [ERR_ASSERTION]: The expression evaluated to a falsy value: · assert.ok(str.includes(<str>)) · at <url> { · generatedMessage: true,javascript/test-runner · test-runner-diagnostic · outer npm test証拠品質: complete · 環境バリアント: 1 · 初回記録: 2026-08-31 · 最終観測: 2026-08-31
-
観測済み UNKNOWN exit 1 証拠の欠落 ×1 3.1.1 executionContext=node · moduleSystem=esm · os=linux · runtime=node@22.23 sha256:994722463fe8…fil<path>:<n> · throw Error( · ^ · Error: Invalid Chai property: toSatisfy. Did you mean <str>?node · unclassified-diagnostic · outer node · gap stage-unknown証拠品質: complete · 環境バリアント: 1 · 初回記録: 2026-08-31 · 最終観測: 2026-08-31診断再検証候補
-
観測済み UNKNOWN exit 1 ERR_ASSERTION 証拠の欠落 ×1 3.1.1 executionContext=node · moduleSystem=cjs · os=linux · runtime=node@22.23 tinyrainbow.disableDefaultColors sha256:986d98189e70…node:internal/modules/run_main:<n> · triggerUncaughtException( · ^ · AssertionError [ERR_ASSERTION]: Expected values to be strictly equal:node · unclassified-diagnostic · outer node · gap stage-unknown証拠品質: complete · 環境バリアント: 1 · 初回記録: 2026-08-31 · 最終観測: 2026-08-31診断再検証候補
-
観測済み PROJECT_TEST exit 1 ERR_LOAD_URL ×1 3.1.1 executionContext=node · moduleSystem=esm · os=linux · runtime=node@22.23 sha256:a60e7101af87…Contract test failed: Error: Failed to load custom Reporter from basic · at loadCustomReporterModule (fil<path>:<n>:<n>) · at fil<path>:<n>:<n> …javascript/test-runner · test-runner-diagnostic · outer npm test証拠品質: complete · 環境バリアント: 1 · 初回記録: 2026-08-31 · 最終観測: 2026-08-31
-
観測済み UNKNOWN exit 1 証拠の欠落 ×1 3.1.1 executionContext=node · moduleSystem=cjs · os=linux · runtime=node@22.23 sha256:6e637860f012…<url>]:<n> · d.promise.then(v => console.log(<str>, v)); · ^ · TypeError: Cannot read properties of undefined (reading <str>)node · unclassified-diagnostic · outer node · gap stage-unknown証拠品質: complete · 環境バリアント: 1 · 初回記録: 2026-09-06 · 最終観測: 2026-09-06診断再検証候補
-
観測済み UNKNOWN exit 1 ERR_ASSERTION 証拠の欠落 ×1 3.1.1 executionContext=node · moduleSystem=cjs · os=linux · runtime=node@22.23 sha256:054c93088b95…node:internal/modules/run_main:<n> · triggerUncaughtException( · ^ …node · unclassified-diagnostic · outer node · gap stage-unknown証拠品質: complete · 環境バリアント: 1 · 初回記録: 2026-09-06 · 最終観測: 2026-09-06診断再検証候補
-
観測済み UNKNOWN exit 1 証拠の欠落 ×1 3.1.1 executionContext=node · moduleSystem=esm · os=linux · runtime=node@22.23 sha256:57bd6b054872…fil<path>:<n> · file.shuffle = config.sequence.shuffle; · ^ · TypeError: Cannot read properties of undefined (reading <str>)node · unclassified-diagnostic · outer node · gap stage-unknown証拠品質: complete · 環境バリアント: 1 · 初回記録: 2026-09-06 · 最終観測: 2026-09-06診断再検証候補
-
観測済み UNKNOWN exit 1 証拠の欠落 ×1 3.1.1 executionContext=node · moduleSystem=cjs · os=linux · runtime=node@22.23 sha256:d6d8c80feaab…<url>]:<n> · import { diff } from <str>; console.log(typeof diff); · ^^^^ · SyntaxError: The requested module <str> does not provide an export named <str>node · unclassified-diagnostic · outer node · gap stage-unknown証拠品質: complete · 環境バリアント: 1 · 初回記録: 2026-09-06 · 最終観測: 2026-09-06診断再検証候補
-
観測済み UNKNOWN exit 1 ERR_ASSERTION 証拠の欠落 ×1 3.1.1 executionContext=node · moduleSystem=cjs · os=linux · runtime=node@22.23 sha256:f1e6d80ff0a8…node:internal/modules/run_main:<n> · triggerUncaughtException( · ^ …node · unclassified-diagnostic · outer node · gap stage-unknown証拠品質: complete · 環境バリアント: 1 · 初回記録: 2026-09-06 · 最終観測: 2026-09-06診断再検証候補
最も多く報告された 12 件を表示しています。この座標に記録された失敗クラスタは 17 件です。残りは単発の報告です。