Relevésnpmtinypool1.1.1Tinypool
Changer les conditions
Conditions actuelles
Tinypool @1.1.1ubuntu glibc · x64 · node 22 · npm 10 · node
0 sur 2 ont réussi
Vérifié — ce réseau a exécuté un contrat à cette coordonnée.
il y a un échantillon ici et notre exécution à cette coordonnée a échoué (2)
- Observations de projets
- 7 / 7
- Vérifications de contrat
- 0 / 2
- Pairs rapporteurs indépendants
- 1
- Dernier enregistrement
- 2026-09-03
Preuves que vous pouvez ouvrir
Santé des dépendances
Une résolution a lu l'arbre de cette version et n'a trouvé aucune dépendance. C'est une mesure, pas une mesure manquante.
Clusters d'échecs récents
-
observé PROCESS_START process start failed Lacune de preuve ×15 1.1.1 executionContext=node sha256:c12549970456…· structured-termination · gap diagnostic-missingQualité de preuve: partial · Variantes d’environnement: 3 · Premier relevé: 2026-08-31 · Dernière observation: 2026-09-16Candidat à une revérification diagnostique
-
observé PROJECT_PROCESS ERR_ASSERTION Lacune de preuve ×5 1.1.1 executionContext=node · os=linux · runtime=node@22.23Qualité de preuve: legacy-evidence-incomplete · Variantes d’environnement: 2 · Premier relevé: 2026-08-21 · Dernière observation: 2026-08-30Candidat à une revérification diagnostique
-
observé UNKNOWN exit 1 Lacune de preuve ×3 1.1.1 executionContext=node · moduleSystem=esm · os=linux · runtime=node@22.23 sha256:8fd30f2a6304…fil<path>:<n> · throw new Error(errorMsg); · ^ · Error: Vitest failed to access its internal state.node · unclassified-diagnostic · outer node · gap stage-unknownQualité de preuve: complete · Variantes d’environnement: 1 · Premier relevé: 2026-08-31 · Dernière observation: 2026-09-08Candidat à une revérification diagnostique
-
observé UNKNOWN exit 1 Lacune de preuve ×2 1.1.1 executionContext=node · moduleSystem=cjs · os=linux · runtime=node@22.23 sha256:72ba2d1e946f…<path>: No module named pippython3 · unclassified-diagnostic · outer python3 · gap stage-unknownQualité de preuve: complete · Variantes d’environnement: 1 · Premier relevé: 2026-08-31 · Dernière observation: 2026-09-02Candidat à une revérification diagnostique
-
observé UNKNOWN exit 1 Lacune de preuve ×1 1.1.1 executionContext=node · moduleSystem=cjs · os=linux · runtime=node@22.23 sha256:91ad26545eb1…node:internal/modules/cjs/loader:<n> · throw err; · ^ · Error: Cannot find module <str>node · unclassified-diagnostic · outer node · gap stage-unknownQualité de preuve: complete · Variantes d’environnement: 1 · Premier relevé: 2026-08-31 · Dernière observation: 2026-08-31Candidat à une revérification diagnostique
-
observé UNKNOWN exit 1 Lacune de preuve ×1 1.1.1 executionContext=node · moduleSystem=cjs · os=linux · runtime=node@22.23 sha256:d7f5d491441c…Traceback (most recent call last): · File <str>, line 71, in <module> · AssertionError: is_annotated must return True for Annotated· unclassified-diagnostic · gap stage-unknownQualité de preuve: complete · Variantes d’environnement: 1 · Premier relevé: 2026-08-31 · Dernière observation: 2026-08-31Candidat à une revérification diagnostique
-
observé UNKNOWN exit 1 Lacune de preuve ×1 1.1.1 executionContext=node · moduleSystem=cjs · os=linux · runtime=node@22.23 sha256:9be950af9140…Traceback (most recent call last): · File <str>, line 1, in <module> · ModuleNotFoundError: No module named <str>python3 · unclassified-diagnostic · outer python3 · gap stage-unknownQualité de preuve: complete · Variantes d’environnement: 1 · Premier relevé: 2026-09-02 · Dernière observation: 2026-09-02Candidat à une revérification diagnostique
-
observé UNKNOWN exit 1 Lacune de preuve ×1 1.1.1 executionContext=node · moduleSystem=cjs · os=linux · runtime=node@22.23 sha256:7789edf7d3db…<path> · <path> · <path>· unclassified-diagnostic · gap stage-unknownQualité de preuve: complete · Variantes d’environnement: 1 · Premier relevé: 2026-09-02 · Dernière observation: 2026-09-02Candidat à une revérification diagnostique
-
observé UNKNOWN exit 1 Lacune de preuve ×1 1.1.1 executionContext=node · moduleSystem=cjs · os=linux · runtime=node@22.23 sha256:bcf4ef8d437b…Traceback (most recent call last): · File <str>, line 1, in <module> · ModuleNotFoundError: No module named <str> · 24.0python3 · unclassified-diagnostic · outer python3 · gap stage-unknownQualité de preuve: complete · Variantes d’environnement: 1 · Premier relevé: 2026-09-02 · Dernière observation: 2026-09-02Candidat à une revérification diagnostique
-
observé UNKNOWN exit 2 EVERYTHING Lacune de preuve ×1 1.1.1 executionContext=node · moduleSystem=cjs · os=linux · runtime=node@22.23 sha256:d29a2deca319…csx sample: unknown subcommand <str> · usage: csx sample <subcommand> · propose --goal G [--package purl]... [--symbol s]... …· unclassified-diagnostic · gap stage-unknownQualité de preuve: complete · Variantes d’environnement: 1 · Premier relevé: 2026-09-02 · Dernière observation: 2026-09-02Candidat à une revérification diagnostique
-
observé UNKNOWN exit 1 Lacune de preuve ×1 1.1.1 executionContext=node · moduleSystem=cjs · os=linux · runtime=node@22.23 sha256:223705e02a51…ReferenceError: __dirname is not defined · at get version (fil<path>:<n>:<n>) · at main (<path>:<n>:<n>) · at Object.<anonymous> (<path>:<n>:<n>)node · unclassified-diagnostic · outer node · gap stage-unknownQualité de preuve: complete · Variantes d’environnement: 1 · Premier relevé: 2026-09-03 · Dernière observation: 2026-09-03Candidat à une revérification diagnostique
-
observé UNKNOWN exit 1 ERR_AMBIGUOUS_MODULE_SYNTAX Lacune de preuve ×1 1.1.1 executionContext=node · moduleSystem=cjs · os=linux · runtime=node@22.23 sha256:2e857e4a17a1…fil<path>:<n> · const { version } = JSON.parse(readFileSync(join(__dirname, <str>), <str>)); · ^ …node · unclassified-diagnostic · outer node · gap stage-unknownQualité de preuve: complete · Variantes d’environnement: 1 · Premier relevé: 2026-09-03 · Dernière observation: 2026-09-03Candidat à une revérification diagnostique
Affichage des 12 plus signalés parmi 15 groupes d’échecs enregistrés. Le reste sont des signalements uniques.