記録npmtinypool1.1.1tinypool.Tinypool
条件を変更
現在の条件
tinypool.Tinypool @1.1.1debian glibc · x64 · node 22 · npm · node
1 回中 1 回が成功
検証 — このネットワークがこの座標でコントラクトを実行しました。
サンプルあり — この座標で実行し、問題なく終わった (2)
- プロジェクト観測
- 1 / 1
- コントラクト検証
- 1 / 1
- 独立した報告ピア
- 1
- 最終記録
- 2026-09-16
開ける証拠
依存関係のヘルス
ある解決処理がこのリリースのツリーを読み、依存関係はありませんでした。欠落ではなく測定結果です。
最近の失敗クラスター
-
観測済み PROCESS_START process start failed 証拠の欠落 ×15 1.1.1 executionContext=node sha256:c12549970456…· structured-termination · gap diagnostic-missing証拠品質: partial · 環境バリアント: 3 · 初回記録: 2026-08-31 · 最終観測: 2026-09-16診断再検証候補
-
観測済み PROJECT_PROCESS ERR_ASSERTION 証拠の欠落 ×5 1.1.1 executionContext=node · os=linux · runtime=node@22.23証拠品質: legacy-evidence-incomplete · 環境バリアント: 2 · 初回記録: 2026-08-21 · 最終観測: 2026-08-30診断再検証候補
-
観測済み UNKNOWN exit 1 証拠の欠落 ×3 1.1.1 executionContext=node · moduleSystem=esm · os=linux · runtime=node@22.23 sha256:8fd30f2a6304…fil<path>:<n> · throw new Error(errorMsg); · ^ · Error: Vitest failed to access its internal state.node · unclassified-diagnostic · outer node · gap stage-unknown証拠品質: complete · 環境バリアント: 1 · 初回記録: 2026-08-31 · 最終観測: 2026-09-08診断再検証候補
-
観測済み UNKNOWN exit 1 証拠の欠落 ×2 1.1.1 executionContext=node · moduleSystem=cjs · os=linux · runtime=node@22.23 sha256:72ba2d1e946f…<path>: No module named pippython3 · unclassified-diagnostic · outer python3 · gap stage-unknown証拠品質: complete · 環境バリアント: 1 · 初回記録: 2026-08-31 · 最終観測: 2026-09-02診断再検証候補
-
観測済み UNKNOWN exit 1 証拠の欠落 ×1 1.1.1 executionContext=node · moduleSystem=cjs · os=linux · runtime=node@22.23 sha256:91ad26545eb1…node:internal/modules/cjs/loader:<n> · throw err; · ^ · Error: Cannot find module <str>node · unclassified-diagnostic · outer node · gap stage-unknown証拠品質: complete · 環境バリアント: 1 · 初回記録: 2026-08-31 · 最終観測: 2026-08-31診断再検証候補
-
観測済み UNKNOWN exit 1 証拠の欠落 ×1 1.1.1 executionContext=node · moduleSystem=cjs · os=linux · runtime=node@22.23 sha256:d7f5d491441c…Traceback (most recent call last): · File <str>, line 71, in <module> · AssertionError: is_annotated must return True for Annotated· unclassified-diagnostic · gap stage-unknown証拠品質: complete · 環境バリアント: 1 · 初回記録: 2026-08-31 · 最終観測: 2026-08-31診断再検証候補
-
観測済み UNKNOWN exit 1 証拠の欠落 ×1 1.1.1 executionContext=node · moduleSystem=cjs · os=linux · runtime=node@22.23 sha256:9be950af9140…Traceback (most recent call last): · File <str>, line 1, in <module> · ModuleNotFoundError: No module named <str>python3 · unclassified-diagnostic · outer python3 · gap stage-unknown証拠品質: complete · 環境バリアント: 1 · 初回記録: 2026-09-02 · 最終観測: 2026-09-02診断再検証候補
-
観測済み UNKNOWN exit 1 証拠の欠落 ×1 1.1.1 executionContext=node · moduleSystem=cjs · os=linux · runtime=node@22.23 sha256:7789edf7d3db…<path> · <path> · <path>· unclassified-diagnostic · gap stage-unknown証拠品質: complete · 環境バリアント: 1 · 初回記録: 2026-09-02 · 最終観測: 2026-09-02診断再検証候補
-
観測済み UNKNOWN exit 1 証拠の欠落 ×1 1.1.1 executionContext=node · moduleSystem=cjs · os=linux · runtime=node@22.23 sha256:bcf4ef8d437b…Traceback (most recent call last): · File <str>, line 1, in <module> · ModuleNotFoundError: No module named <str> · 24.0python3 · unclassified-diagnostic · outer python3 · gap stage-unknown証拠品質: complete · 環境バリアント: 1 · 初回記録: 2026-09-02 · 最終観測: 2026-09-02診断再検証候補
-
観測済み UNKNOWN exit 2 EVERYTHING 証拠の欠落 ×1 1.1.1 executionContext=node · moduleSystem=cjs · os=linux · runtime=node@22.23 sha256:d29a2deca319…csx sample: unknown subcommand <str> · usage: csx sample <subcommand> · propose --goal G [--package purl]... [--symbol s]... …· unclassified-diagnostic · gap stage-unknown証拠品質: complete · 環境バリアント: 1 · 初回記録: 2026-09-02 · 最終観測: 2026-09-02診断再検証候補
-
観測済み UNKNOWN exit 1 証拠の欠落 ×1 1.1.1 executionContext=node · moduleSystem=cjs · os=linux · runtime=node@22.23 tinypool.Tinypool sha256:223705e02a51…ReferenceError: __dirname is not defined · at get version (fil<path>:<n>:<n>) · at main (<path>:<n>:<n>) · at Object.<anonymous> (<path>:<n>:<n>)node · unclassified-diagnostic · outer node · gap stage-unknown証拠品質: complete · 環境バリアント: 1 · 初回記録: 2026-09-03 · 最終観測: 2026-09-03診断再検証候補
-
観測済み UNKNOWN exit 1 ERR_AMBIGUOUS_MODULE_SYNTAX 証拠の欠落 ×1 1.1.1 executionContext=node · moduleSystem=cjs · os=linux · runtime=node@22.23 tinypool.Tinypool sha256:2e857e4a17a1…fil<path>:<n> · const { version } = JSON.parse(readFileSync(join(__dirname, <str>), <str>)); · ^ …node · unclassified-diagnostic · outer node · gap stage-unknown証拠品質: complete · 環境バリアント: 1 · 初回記録: 2026-09-03 · 最終観測: 2026-09-03診断再検証候補
最も多く報告された 12 件を表示しています。この座標に記録された失敗クラスタは 15 件です。残りは単発の報告です。