Registrosnpmtinypool1.1.1Tinypool.run
Mudar as condições
Condições atuais
Tinypool.run @1.1.1debian glibc · x64 · node 22 · npm · node
1 de 1 passaram
Verificado — esta rede executou um contrato nesta coordenada.
há uma amostra aqui e nossa execução nesta coordenada terminou limpa (1)
- Observações de projetos
- 1 / 1
- Verificações de contrato
- 1 / 1
- Peers independentes que reportaram
- 1
- Último registro
- 2026-09-14
Evidências que você pode abrir
Saúde das dependências
Uma resolução leu a árvore desta versão e não encontrou dependências. Isso é uma medição, não uma medição ausente.
Clusters de falha recentes
-
observado PROCESS_START process start failed Lacuna de evidência ×15 1.1.1 executionContext=node sha256:c12549970456…· structured-termination · gap diagnostic-missingQualidade da evidência: partial · Variantes de ambiente: 3 · Primeiro registro: 2026-08-31 · Visto por último: 2026-09-16Candidato a reverificação diagnóstica
-
observado PROJECT_PROCESS ERR_ASSERTION Lacuna de evidência ×5 1.1.1 executionContext=node · os=linux · runtime=node@22.23Qualidade da evidência: legacy-evidence-incomplete · Variantes de ambiente: 2 · Primeiro registro: 2026-08-21 · Visto por último: 2026-08-30Candidato a reverificação diagnóstica
-
observado UNKNOWN exit 1 Lacuna de evidência ×3 1.1.1 executionContext=node · moduleSystem=esm · os=linux · runtime=node@22.23 sha256:8fd30f2a6304…fil<path>:<n> · throw new Error(errorMsg); · ^ · Error: Vitest failed to access its internal state.node · unclassified-diagnostic · outer node · gap stage-unknownQualidade da evidência: complete · Variantes de ambiente: 1 · Primeiro registro: 2026-08-31 · Visto por último: 2026-09-08Candidato a reverificação diagnóstica
-
observado UNKNOWN exit 1 Lacuna de evidência ×2 1.1.1 executionContext=node · moduleSystem=cjs · os=linux · runtime=node@22.23 sha256:72ba2d1e946f…<path>: No module named pippython3 · unclassified-diagnostic · outer python3 · gap stage-unknownQualidade da evidência: complete · Variantes de ambiente: 1 · Primeiro registro: 2026-08-31 · Visto por último: 2026-09-02Candidato a reverificação diagnóstica
-
observado UNKNOWN exit 1 Lacuna de evidência ×1 1.1.1 executionContext=node · moduleSystem=cjs · os=linux · runtime=node@22.23 sha256:91ad26545eb1…node:internal/modules/cjs/loader:<n> · throw err; · ^ · Error: Cannot find module <str>node · unclassified-diagnostic · outer node · gap stage-unknownQualidade da evidência: complete · Variantes de ambiente: 1 · Primeiro registro: 2026-08-31 · Visto por último: 2026-08-31Candidato a reverificação diagnóstica
-
observado UNKNOWN exit 1 Lacuna de evidência ×1 1.1.1 executionContext=node · moduleSystem=cjs · os=linux · runtime=node@22.23 sha256:d7f5d491441c…Traceback (most recent call last): · File <str>, line 71, in <module> · AssertionError: is_annotated must return True for Annotated· unclassified-diagnostic · gap stage-unknownQualidade da evidência: complete · Variantes de ambiente: 1 · Primeiro registro: 2026-08-31 · Visto por último: 2026-08-31Candidato a reverificação diagnóstica
-
observado UNKNOWN exit 1 Lacuna de evidência ×1 1.1.1 executionContext=node · moduleSystem=cjs · os=linux · runtime=node@22.23 sha256:9be950af9140…Traceback (most recent call last): · File <str>, line 1, in <module> · ModuleNotFoundError: No module named <str>python3 · unclassified-diagnostic · outer python3 · gap stage-unknownQualidade da evidência: complete · Variantes de ambiente: 1 · Primeiro registro: 2026-09-02 · Visto por último: 2026-09-02Candidato a reverificação diagnóstica
-
observado UNKNOWN exit 1 Lacuna de evidência ×1 1.1.1 executionContext=node · moduleSystem=cjs · os=linux · runtime=node@22.23 sha256:7789edf7d3db…<path> · <path> · <path>· unclassified-diagnostic · gap stage-unknownQualidade da evidência: complete · Variantes de ambiente: 1 · Primeiro registro: 2026-09-02 · Visto por último: 2026-09-02Candidato a reverificação diagnóstica
-
observado UNKNOWN exit 1 Lacuna de evidência ×1 1.1.1 executionContext=node · moduleSystem=cjs · os=linux · runtime=node@22.23 sha256:bcf4ef8d437b…Traceback (most recent call last): · File <str>, line 1, in <module> · ModuleNotFoundError: No module named <str> · 24.0python3 · unclassified-diagnostic · outer python3 · gap stage-unknownQualidade da evidência: complete · Variantes de ambiente: 1 · Primeiro registro: 2026-09-02 · Visto por último: 2026-09-02Candidato a reverificação diagnóstica
-
observado UNKNOWN exit 2 EVERYTHING Lacuna de evidência ×1 1.1.1 executionContext=node · moduleSystem=cjs · os=linux · runtime=node@22.23 sha256:d29a2deca319…csx sample: unknown subcommand <str> · usage: csx sample <subcommand> · propose --goal G [--package purl]... [--symbol s]... …· unclassified-diagnostic · gap stage-unknownQualidade da evidência: complete · Variantes de ambiente: 1 · Primeiro registro: 2026-09-02 · Visto por último: 2026-09-02Candidato a reverificação diagnóstica
-
observado UNKNOWN exit 1 Lacuna de evidência ×1 1.1.1 executionContext=node · moduleSystem=cjs · os=linux · runtime=node@22.23 sha256:223705e02a51…ReferenceError: __dirname is not defined · at get version (fil<path>:<n>:<n>) · at main (<path>:<n>:<n>) · at Object.<anonymous> (<path>:<n>:<n>)node · unclassified-diagnostic · outer node · gap stage-unknownQualidade da evidência: complete · Variantes de ambiente: 1 · Primeiro registro: 2026-09-03 · Visto por último: 2026-09-03Candidato a reverificação diagnóstica
-
observado UNKNOWN exit 1 ERR_AMBIGUOUS_MODULE_SYNTAX Lacuna de evidência ×1 1.1.1 executionContext=node · moduleSystem=cjs · os=linux · runtime=node@22.23 sha256:2e857e4a17a1…fil<path>:<n> · const { version } = JSON.parse(readFileSync(join(__dirname, <str>), <str>)); · ^ …node · unclassified-diagnostic · outer node · gap stage-unknownQualidade da evidência: complete · Variantes de ambiente: 1 · Primeiro registro: 2026-09-03 · Visto por último: 2026-09-03Candidato a reverificação diagnóstica
Mostrando os 12 mais relatados de 15 grupos de falhas registrados. O resto são relatos únicos.