Relevésnpmtinyglobby0.2.17tinyglobby.globSync
Changer les conditions
Conditions actuelles
tinyglobby.globSync @0.2.17ubuntu glibc · x64 · node 22 · npm 10 · node
0 sur 2 ont réussi
Vérifié — ce réseau a exécuté un contrat à cette coordonnée.
il y a un échantillon ici et notre exécution à cette coordonnée a échoué (1)
- Observations de projets
- 1 / 1
- Vérifications de contrat
- 0 / 2
- Pairs rapporteurs indépendants
- 1
- Dernier enregistrement
- 2026-08-31
Santé des dépendances
Combinaisons observées et preuves d'échec pour cette version
Premier échec observé
0.2.17
executionContext=node
40 FAIL
· stage: PROCESS_START
· fingerprint: sha256:c12549970456efb5abdc90b679695c6689107d4f097d612245d6bfb25e01ec32
| Bibliothèque | Version | Santé | Mesuré là-bas | Projets |
|---|---|---|---|---|
| picomatch | 4.0.4 | CANDIDATE Changement corrélé; combinaison non prouvée | contrat réussi | 1 jour-projet |
| picomatch | 4.0.5 | CANDIDATE Changement corrélé; combinaison non prouvée | contrat réussi | 24 jours-projet |
| picomatch | 4.0.7 | CANDIDATE Changement corrélé; combinaison non prouvée | contrat réussi | 135 jours-projet |
| fdir | 6.5.0 | PASS Toutes les observations ont réussi | contrat réussi | 167 jours-projet |
La colonne de mesure porte sur la version de chaque dépendance elle-même, pas sur la paire. Qu'un résolveur ait placé deux versions côte à côte ne prouve pas qu'elles fonctionnent ensemble.
Versions des dépendances au fil des versions
Ce vers quoi chaque version de ce paquet a résolu ses enfants. L'enfant dont la version a bougé vient en premier : c'est là qu'une mise à jour a changé quelque chose sous vos pieds.
Ont bougé : 1 · identiques à chaque version : 1
Une arête indique qu'un résolveur a placé une version à côté d'une autre sur une machine réelle. Ce n'est pas une affirmation qu'elles fonctionnent ensemble ; à cette question répondent les échantillons et les contrats, pas la présence d'une ligne.
Clusters d'échecs récents
-
observé PROCESS_START process start failed Lacune de preuve ×40 0.2.17 executionContext=node sha256:c12549970456…· structured-termination · gap diagnostic-missingQualité de preuve: partial · Variantes d’environnement: 4 · Premier relevé: 2026-09-08 · Dernière observation: 2026-09-16Candidat à une revérification diagnostique
-
observé PROJECT_PROCESS ERR_ASSERTION Lacune de preuve ×7 0.2.17 executionContext=nodeQualité de preuve: legacy-evidence-incomplete · Variantes d’environnement: 3 · Premier relevé: 2026-08-14 · Dernière observation: 2026-08-30Candidat à une revérification diagnostique
-
observé UNKNOWN exit 1 ERR_ASSERTION Lacune de preuve ×7 0.2.17 executionContext=node · os=linux · runtime=node@22.23 sha256:986d98189e70…node:internal/modules/run_main:<n> · triggerUncaughtException( · ^ · AssertionError [ERR_ASSERTION]: Expected values to be strictly equal:node · unclassified-diagnostic · outer node · gap stage-unknownQualité de preuve: complete · Variantes d’environnement: 2 · Premier relevé: 2026-08-29 · Dernière observation: 2026-09-14Candidat à une revérification diagnostique
-
observé UNKNOWN exit 1 ERR_ASSERTION Lacune de preuve ×2 0.2.17 executionContext=node · moduleSystem=esm · os=linux · runtime=node@22.23 sha256:10e769edac62…node:internal/modules/run_main:<n> · triggerUncaughtException( · ^ · AssertionError [ERR_ASSERTION]: The expression evaluated to a falsy value:node · unclassified-diagnostic · outer node · gap stage-unknownQualité de preuve: complete · Variantes d’environnement: 1 · Premier relevé: 2026-08-31 · Dernière observation: 2026-08-31Candidat à une revérification diagnostique
-
observé UNKNOWN exit 1 ERR_ASSERTION Lacune de preuve ×2 0.2.17 executionContext=node · moduleSystem=cjs · os=linux · runtime=node@22.23 sha256:0ab3a7004d66…node:assert:<n> · throw new AssertionError(obj); · ^ · AssertionError [ERR_ASSERTION]: Expected values to be strictly equal:node · unclassified-diagnostic · outer node · gap stage-unknownQualité de preuve: complete · Variantes d’environnement: 1 · Premier relevé: 2026-09-05 · Dernière observation: 2026-09-05Candidat à une revérification diagnostique
-
observé UNKNOWN exit 1 Lacune de preuve ×2 0.2.17 executionContext=node · os=linux · runtime=node@22.23 sha256:0bd98c410653…<path>:<n> · param.decorators.forEach(d => this.visit(d)); · ^ · TypeError: Cannot read properties of undefined (reading <str>)node · unclassified-diagnostic · outer node · gap stage-unknownQualité de preuve: complete · Variantes d’environnement: 2 · Premier relevé: 2026-09-05 · Dernière observation: 2026-09-05Candidat à une revérification diagnostique
-
observé UNKNOWN exit 1 Lacune de preuve ×2 0.2.17 executionContext=node · moduleSystem=cjs · os=linux · runtime=node@22.23 sha256:91ad26545eb1…node:internal/modules/cjs/loader:<n> · throw err; · ^ · Error: Cannot find module <str>node · unclassified-diagnostic · outer node · gap stage-unknownQualité de preuve: complete · Variantes d’environnement: 1 · Premier relevé: 2026-09-06 · Dernière observation: 2026-09-06Candidat à une revérification diagnostique
-
observé UNKNOWN exit 1 Lacune de preuve ×2 0.2.17 executionContext=node · moduleSystem=esm · os=linux · runtime=node@22.23 sha256:8fd30f2a6304…fil<path>:<n> · throw new Error(errorMsg); · ^ · Error: Vitest failed to access its internal state.node · unclassified-diagnostic · outer node · gap stage-unknownQualité de preuve: complete · Variantes d’environnement: 1 · Premier relevé: 2026-09-08 · Dernière observation: 2026-09-08Candidat à une revérification diagnostique
-
observé UNKNOWN exit 1 ERR_MODULE_NOT_FOUND Lacune de preuve ×2 0.2.17 executionContext=node · moduleSystem=cjs · os=linux · runtime=node@22.23 sha256:88af852f99a8…node:internal/modules/package_json_reader:<n> · throw new ERR_MODULE_NOT_FOUND(packageName, fileURLToPath(base), null); · ^ …node · unclassified-diagnostic · outer node · gap stage-unknownQualité de preuve: complete · Variantes d’environnement: 1 · Premier relevé: 2026-09-14 · Dernière observation: 2026-09-14Candidat à une revérification diagnostique
-
observé UNKNOWN exit 1 ERR_ASSERTION Lacune de preuve ×1 0.2.17 executionContext=node · moduleSystem=cjs · os=linux · runtime=node@22.23 sha256:0d62cac8c07a…AssertionError [ERR_ASSERTION]: Expected values to be strictly equal: · + actual - expected · + <str> · - <str>node · unclassified-diagnostic · outer node · gap stage-unknownQualité de preuve: complete · Variantes d’environnement: 1 · Premier relevé: 2026-08-31 · Dernière observation: 2026-08-31Candidat à une revérification diagnostique
-
observé UNKNOWN exit 1 Lacune de preuve ×1 0.2.17 executionContext=node · moduleSystem=cjs · os=linux · runtime=node@22.23 sha256:e1d65fc7c136…<path>:<n> · throw new Error(`Unsupported arch ${name}`) · ^ · Error: Unsupported arch 1node · unclassified-diagnostic · outer node · gap stage-unknownQualité de preuve: complete · Variantes d’environnement: 1 · Premier relevé: 2026-08-31 · Dernière observation: 2026-08-31Candidat à une revérification diagnostique
-
observé UNKNOWN exit 1 ERR_ASSERTION Lacune de preuve ×1 0.2.17 executionContext=node · moduleSystem=cjs · os=linux · runtime=node@22.23 sha256:8bad55cbf7c6…node:internal/assert/utils:<n> · throw err; · ^ · AssertionError [ERR_ASSERTION]: ScopeManager should record variable alphanode · unclassified-diagnostic · outer node · gap stage-unknownQualité de preuve: complete · Variantes d’environnement: 1 · Premier relevé: 2026-08-31 · Dernière observation: 2026-08-31Candidat à une revérification diagnostique
Affichage des 12 plus signalés parmi 40 groupes d’échecs enregistrés. Le reste sont des signalements uniques.