Registrosnpmtinyglobby0.2.17tinyglobby.globSync
Cambiar las condiciones
Condiciones actuales
tinyglobby.globSync @0.2.17ubuntu glibc · x64 · node 22 · npm 10 · node
0 de 2 pasaron
Verificado: esta red ejecutó un contrato en esta coordenada.
hay una muestra aquí y nuestra ejecución en esta coordenada falló (1)
- Observaciones de proyectos
- 1 / 1
- Verificaciones de contrato
- 0 / 2
- Peers independientes que reportaron
- 1
- Último registro
- 2026-08-31
Salud de dependencias
Combinaciones observadas y evidencia de fallos para esta versión
Primer fallo observado
0.2.17
executionContext=node
40 FAIL
· stage: PROCESS_START
· fingerprint: sha256:c12549970456efb5abdc90b679695c6689107d4f097d612245d6bfb25e01ec32
| Biblioteca | Versión | Estado | Medido allí | Proyectos |
|---|---|---|---|---|
| picomatch | 4.0.4 | CANDIDATE Cambio correlacionado; combinación no probada | contrato aprobado | 1 día-proyecto |
| picomatch | 4.0.5 | CANDIDATE Cambio correlacionado; combinación no probada | contrato aprobado | 24 días-proyecto |
| picomatch | 4.0.7 | CANDIDATE Cambio correlacionado; combinación no probada | contrato aprobado | 135 días-proyecto |
| fdir | 6.5.0 | PASS Todas las observaciones pasaron | contrato aprobado | 167 días-proyecto |
La columna de medición se refiere a la versión de cada dependencia en sí, no al par. Que un resolutor haya colocado dos versiones juntas no prueba que funcionen juntas.
Versiones de dependencias por versión
A qué resolvió sus hijos cada versión de este paquete. Primero va el hijo cuya versión se movió: ahí una actualización cambió algo bajo tus pies.
Se movieron: 1 · iguales en todas las versiones: 1
Una arista registra que un resolutor colocó una versión junto a otra en una máquina real. No afirma que ambas funcionen juntas; a esa pregunta responden las muestras y los contratos, no la presencia de una fila.
Clústeres de fallos recientes
-
observado PROCESS_START process start failed Brecha de evidencia ×40 0.2.17 executionContext=node sha256:c12549970456…· structured-termination · gap diagnostic-missingCalidad de evidencia: partial · Variantes de entorno: 4 · Primer registro: 2026-09-08 · Última observación: 2026-09-16Candidato a reverificación diagnóstica
-
observado PROJECT_PROCESS ERR_ASSERTION Brecha de evidencia ×7 0.2.17 executionContext=nodeCalidad de evidencia: legacy-evidence-incomplete · Variantes de entorno: 3 · Primer registro: 2026-08-14 · Última observación: 2026-08-30Candidato a reverificación diagnóstica
-
observado UNKNOWN exit 1 ERR_ASSERTION Brecha de evidencia ×7 0.2.17 executionContext=node · os=linux · runtime=node@22.23 sha256:986d98189e70…node:internal/modules/run_main:<n> · triggerUncaughtException( · ^ · AssertionError [ERR_ASSERTION]: Expected values to be strictly equal:node · unclassified-diagnostic · outer node · gap stage-unknownCalidad de evidencia: complete · Variantes de entorno: 2 · Primer registro: 2026-08-29 · Última observación: 2026-09-14Candidato a reverificación diagnóstica
-
observado UNKNOWN exit 1 ERR_ASSERTION Brecha de evidencia ×2 0.2.17 executionContext=node · moduleSystem=esm · os=linux · runtime=node@22.23 sha256:10e769edac62…node:internal/modules/run_main:<n> · triggerUncaughtException( · ^ · AssertionError [ERR_ASSERTION]: The expression evaluated to a falsy value:node · unclassified-diagnostic · outer node · gap stage-unknownCalidad de evidencia: complete · Variantes de entorno: 1 · Primer registro: 2026-08-31 · Última observación: 2026-08-31Candidato a reverificación diagnóstica
-
observado UNKNOWN exit 1 ERR_ASSERTION Brecha de evidencia ×2 0.2.17 executionContext=node · moduleSystem=cjs · os=linux · runtime=node@22.23 sha256:0ab3a7004d66…node:assert:<n> · throw new AssertionError(obj); · ^ · AssertionError [ERR_ASSERTION]: Expected values to be strictly equal:node · unclassified-diagnostic · outer node · gap stage-unknownCalidad de evidencia: complete · Variantes de entorno: 1 · Primer registro: 2026-09-05 · Última observación: 2026-09-05Candidato a reverificación diagnóstica
-
observado UNKNOWN exit 1 Brecha de evidencia ×2 0.2.17 executionContext=node · os=linux · runtime=node@22.23 sha256:0bd98c410653…<path>:<n> · param.decorators.forEach(d => this.visit(d)); · ^ · TypeError: Cannot read properties of undefined (reading <str>)node · unclassified-diagnostic · outer node · gap stage-unknownCalidad de evidencia: complete · Variantes de entorno: 2 · Primer registro: 2026-09-05 · Última observación: 2026-09-05Candidato a reverificación diagnóstica
-
observado UNKNOWN exit 1 Brecha de evidencia ×2 0.2.17 executionContext=node · moduleSystem=cjs · os=linux · runtime=node@22.23 sha256:91ad26545eb1…node:internal/modules/cjs/loader:<n> · throw err; · ^ · Error: Cannot find module <str>node · unclassified-diagnostic · outer node · gap stage-unknownCalidad de evidencia: complete · Variantes de entorno: 1 · Primer registro: 2026-09-06 · Última observación: 2026-09-06Candidato a reverificación diagnóstica
-
observado UNKNOWN exit 1 Brecha de evidencia ×2 0.2.17 executionContext=node · moduleSystem=esm · os=linux · runtime=node@22.23 sha256:8fd30f2a6304…fil<path>:<n> · throw new Error(errorMsg); · ^ · Error: Vitest failed to access its internal state.node · unclassified-diagnostic · outer node · gap stage-unknownCalidad de evidencia: complete · Variantes de entorno: 1 · Primer registro: 2026-09-08 · Última observación: 2026-09-08Candidato a reverificación diagnóstica
-
observado UNKNOWN exit 1 ERR_MODULE_NOT_FOUND Brecha de evidencia ×2 0.2.17 executionContext=node · moduleSystem=cjs · os=linux · runtime=node@22.23 sha256:88af852f99a8…node:internal/modules/package_json_reader:<n> · throw new ERR_MODULE_NOT_FOUND(packageName, fileURLToPath(base), null); · ^ …node · unclassified-diagnostic · outer node · gap stage-unknownCalidad de evidencia: complete · Variantes de entorno: 1 · Primer registro: 2026-09-14 · Última observación: 2026-09-14Candidato a reverificación diagnóstica
-
observado UNKNOWN exit 1 ERR_ASSERTION Brecha de evidencia ×1 0.2.17 executionContext=node · moduleSystem=cjs · os=linux · runtime=node@22.23 sha256:0d62cac8c07a…AssertionError [ERR_ASSERTION]: Expected values to be strictly equal: · + actual - expected · + <str> · - <str>node · unclassified-diagnostic · outer node · gap stage-unknownCalidad de evidencia: complete · Variantes de entorno: 1 · Primer registro: 2026-08-31 · Última observación: 2026-08-31Candidato a reverificación diagnóstica
-
observado UNKNOWN exit 1 Brecha de evidencia ×1 0.2.17 executionContext=node · moduleSystem=cjs · os=linux · runtime=node@22.23 sha256:e1d65fc7c136…<path>:<n> · throw new Error(`Unsupported arch ${name}`) · ^ · Error: Unsupported arch 1node · unclassified-diagnostic · outer node · gap stage-unknownCalidad de evidencia: complete · Variantes de entorno: 1 · Primer registro: 2026-08-31 · Última observación: 2026-08-31Candidato a reverificación diagnóstica
-
observado UNKNOWN exit 1 ERR_ASSERTION Brecha de evidencia ×1 0.2.17 executionContext=node · moduleSystem=cjs · os=linux · runtime=node@22.23 sha256:8bad55cbf7c6…node:internal/assert/utils:<n> · throw err; · ^ · AssertionError [ERR_ASSERTION]: ScopeManager should record variable alphanode · unclassified-diagnostic · outer node · gap stage-unknownCalidad de evidencia: complete · Variantes de entorno: 1 · Primer registro: 2026-08-31 · Última observación: 2026-08-31Candidato a reverificación diagnóstica
Se muestran los 12 más reportados de 40 grupos de fallos registrados. El resto son reportes únicos.