Recordsnpmtinyglobby0.2.17tinyglobby.convertPathToPattern
Change the conditions
Current conditions
tinyglobby.convertPathToPattern @0.2.17ubuntu glibc · x64 · node 22 · npm 10 · node
0 of 2 passed
Verified — this network ran a contract at this coordinate.
there is a sample here, and our run of it at this coordinate failed
- Project observations
- 1 / 1
- Contract verifications
- 0 / 2
- Independent reporting peers
- 1
- Last recorded
- 2026-08-31
Dependency Health
Observed combinations and failure evidence for this release
First observed break
0.2.17
executionContext=node
40 FAIL
· stage: PROCESS_START
· fingerprint: sha256:c12549970456efb5abdc90b679695c6689107d4f097d612245d6bfb25e01ec32
| Library | Version | Health | Measured there | Projects |
|---|---|---|---|---|
| picomatch | 4.0.4 | CANDIDATE Correlated change; unproven combination | contract passed | 1 project-day |
| picomatch | 4.0.5 | CANDIDATE Correlated change; unproven combination | contract passed | 24 project-days |
| picomatch | 4.0.7 | CANDIDATE Correlated change; unproven combination | contract passed | 135 project-days |
| fdir | 6.5.0 | PASS All observations passed | contract passed | 167 project-days |
The measured column is about each dependency's own release, not about the pair. A resolver placing two releases side by side is not evidence that they work together.
Dependency versions across releases
What each release of this package resolved its children to. A child whose version moved is listed first: that is where an upgrade changed something underneath you.
Moved: 1 · unchanged at every release: 1
An edge records that a resolver placed one release beside another on a real machine. It is not a claim that the two work together; that question is answered by samples and contracts, not by presence here.
Recent failure clusters
-
observed PROCESS_START process start failed Evidence gap ×40 0.2.17 executionContext=node sha256:c12549970456…· structured-termination · gap diagnostic-missingEvidence quality: partial · Environment variants: 4 · First recorded: 2026-09-08 · Last seen: 2026-09-16Diagnostic re-verification candidate
-
observed PROJECT_PROCESS ERR_ASSERTION Evidence gap ×7 0.2.17 executionContext=nodeEvidence quality: legacy-evidence-incomplete · Environment variants: 3 · First recorded: 2026-08-14 · Last seen: 2026-08-30Diagnostic re-verification candidate
-
observed UNKNOWN exit 1 ERR_ASSERTION Evidence gap ×7 0.2.17 executionContext=node · os=linux · runtime=node@22.23 sha256:986d98189e70…node:internal/modules/run_main:<n> · triggerUncaughtException( · ^ · AssertionError [ERR_ASSERTION]: Expected values to be strictly equal:node · unclassified-diagnostic · outer node · gap stage-unknownEvidence quality: complete · Environment variants: 2 · First recorded: 2026-08-29 · Last seen: 2026-09-14Diagnostic re-verification candidate
-
observed UNKNOWN exit 1 ERR_ASSERTION Evidence gap ×2 0.2.17 executionContext=node · moduleSystem=esm · os=linux · runtime=node@22.23 sha256:10e769edac62…node:internal/modules/run_main:<n> · triggerUncaughtException( · ^ · AssertionError [ERR_ASSERTION]: The expression evaluated to a falsy value:node · unclassified-diagnostic · outer node · gap stage-unknownEvidence quality: complete · Environment variants: 1 · First recorded: 2026-08-31 · Last seen: 2026-08-31Diagnostic re-verification candidate
-
observed UNKNOWN exit 1 ERR_ASSERTION Evidence gap ×2 0.2.17 executionContext=node · moduleSystem=cjs · os=linux · runtime=node@22.23 sha256:0ab3a7004d66…node:assert:<n> · throw new AssertionError(obj); · ^ · AssertionError [ERR_ASSERTION]: Expected values to be strictly equal:node · unclassified-diagnostic · outer node · gap stage-unknownEvidence quality: complete · Environment variants: 1 · First recorded: 2026-09-05 · Last seen: 2026-09-05Diagnostic re-verification candidate
-
observed UNKNOWN exit 1 Evidence gap ×2 0.2.17 executionContext=node · os=linux · runtime=node@22.23 sha256:0bd98c410653…<path>:<n> · param.decorators.forEach(d => this.visit(d)); · ^ · TypeError: Cannot read properties of undefined (reading <str>)node · unclassified-diagnostic · outer node · gap stage-unknownEvidence quality: complete · Environment variants: 2 · First recorded: 2026-09-05 · Last seen: 2026-09-05Diagnostic re-verification candidate
-
observed UNKNOWN exit 1 Evidence gap ×2 0.2.17 executionContext=node · moduleSystem=cjs · os=linux · runtime=node@22.23 sha256:91ad26545eb1…node:internal/modules/cjs/loader:<n> · throw err; · ^ · Error: Cannot find module <str>node · unclassified-diagnostic · outer node · gap stage-unknownEvidence quality: complete · Environment variants: 1 · First recorded: 2026-09-06 · Last seen: 2026-09-06Diagnostic re-verification candidate
-
observed UNKNOWN exit 1 Evidence gap ×2 0.2.17 executionContext=node · moduleSystem=esm · os=linux · runtime=node@22.23 sha256:8fd30f2a6304…fil<path>:<n> · throw new Error(errorMsg); · ^ · Error: Vitest failed to access its internal state.node · unclassified-diagnostic · outer node · gap stage-unknownEvidence quality: complete · Environment variants: 1 · First recorded: 2026-09-08 · Last seen: 2026-09-08Diagnostic re-verification candidate
-
observed UNKNOWN exit 1 ERR_MODULE_NOT_FOUND Evidence gap ×2 0.2.17 executionContext=node · moduleSystem=cjs · os=linux · runtime=node@22.23 sha256:88af852f99a8…node:internal/modules/package_json_reader:<n> · throw new ERR_MODULE_NOT_FOUND(packageName, fileURLToPath(base), null); · ^ …node · unclassified-diagnostic · outer node · gap stage-unknownEvidence quality: complete · Environment variants: 1 · First recorded: 2026-09-14 · Last seen: 2026-09-14Diagnostic re-verification candidate
-
observed UNKNOWN exit 1 ERR_ASSERTION Evidence gap ×1 0.2.17 executionContext=node · moduleSystem=cjs · os=linux · runtime=node@22.23 sha256:0d62cac8c07a…AssertionError [ERR_ASSERTION]: Expected values to be strictly equal: · + actual - expected · + <str> · - <str>node · unclassified-diagnostic · outer node · gap stage-unknownEvidence quality: complete · Environment variants: 1 · First recorded: 2026-08-31 · Last seen: 2026-08-31Diagnostic re-verification candidate
-
observed UNKNOWN exit 1 Evidence gap ×1 0.2.17 executionContext=node · moduleSystem=cjs · os=linux · runtime=node@22.23 sha256:e1d65fc7c136…<path>:<n> · throw new Error(`Unsupported arch ${name}`) · ^ · Error: Unsupported arch 1node · unclassified-diagnostic · outer node · gap stage-unknownEvidence quality: complete · Environment variants: 1 · First recorded: 2026-08-31 · Last seen: 2026-08-31Diagnostic re-verification candidate
-
observed UNKNOWN exit 1 ERR_ASSERTION Evidence gap ×1 0.2.17 executionContext=node · moduleSystem=cjs · os=linux · runtime=node@22.23 sha256:8bad55cbf7c6…node:internal/assert/utils:<n> · throw err; · ^ · AssertionError [ERR_ASSERTION]: ScopeManager should record variable alphanode · unclassified-diagnostic · outer node · gap stage-unknownEvidence quality: complete · Environment variants: 1 · First recorded: 2026-08-31 · Last seen: 2026-08-31Diagnostic re-verification candidate
Showing the 12 most-reported of 40 recorded failure clusters. The rest are single reports.