Recordsnpmstrip-ansi6.0.1
Change the conditions
Current conditions
strip-ansi @6.0.1windows · x64 · node 24 · pnpm 10 · node
package-level total, not an API
0 of 220 passed
Verified — this network ran a contract at this coordinate.
there is a sample here, and our run of it at this coordinate failed (1)
- Project observations
- 287 / 378
- Contract verifications
- 0 / 220
- Usage records
- 1,206
- Independent reporting peers
- 1
- Failures with a captured fingerprint
- 90 / 91
- Last recorded
- 2026-09-16
Dependency Health
Observed combinations and failure evidence for this release
First observed break
6.0.1
windows · node@24.13 · moduleSystem=esm · executionContext=node
31 FAIL
· stage: UNKNOWN
· fingerprint: sha256:9f91c975308128a0f4f23e33b9d5936b9c39535b5c01aa9245b8cdc4b0a37a10
| Library | Version | Health | Measured there | Projects |
|---|---|---|---|---|
| ansi-regex | 5.0.1 | CANDIDATE Correlated change; unproven combination | contract passed | 74 project-days |
The measured column is about each dependency's own release, not about the pair. A resolver placing two releases side by side is not evidence that they work together.
Dependency versions across releases
What each release of this package resolved its children to. A child whose version moved is listed first: that is where an upgrade changed something underneath you.
| Library | 7.2.0 | 7.1.2 | 6.0.1 |
|---|---|---|---|
| ansi-regex | 6.2.2 | 6.2.2 | 5.0.1 |
Moved: 1 · unchanged at every release: 0
An edge records that a resolver placed one release beside another on a real machine. It is not a claim that the two work together; that question is answered by samples and contracts, not by presence here.
Recent failure clusters
-
observed UNKNOWN exit 1 ERR_PNPM_RECURSIVE_RUN_FIRST_FAIL Evidence gap ×31 6.0.1 executionContext=node · moduleSystem=esm · os=windows · runtime=node@24.13 sha256:9f91c9753081…(node:<n>) ExperimentalWarning: SQLite is an experimental feature and might change at any time …pnpm · unclassified-diagnostic · outer pnpm · gap stage-unknownEvidence quality: complete · Environment variants: 1 · First recorded: 2026-09-01 · Last seen: 2026-09-15Diagnostic re-verification candidate
-
observed UNKNOWN exit 1 ERR_PNPM_RECURSIVE_EXEC_FIRST_FAIL Evidence gap ×28 6.0.1 executionContext=node · moduleSystem=esm · os=windows · runtime=node@24.13 sha256:979755e6489d…(node:<n>) ExperimentalWarning: SQLite is an experimental feature and might change at any time …pnpm · unclassified-diagnostic · outer pnpm · gap stage-unknownEvidence quality: complete · Environment variants: 1 · First recorded: 2026-09-01 · Last seen: 2026-09-15Diagnostic re-verification candidate
-
observed UNKNOWN exit 1 ERR_PNPM_RECURSIVE_EXEC_FIRST_FAIL Evidence gap ×11 6.0.1 executionContext=node · moduleSystem=esm · os=windows · runtime=node@24.13 sha256:73873d2c4aed…<str> is not recognized as an internal or external command, · operable program or batch file. · undefined …pnpm · unclassified-diagnostic · outer pnpm · gap stage-unknownEvidence quality: complete · Environment variants: 1 · First recorded: 2026-09-01 · Last seen: 2026-09-01Diagnostic re-verification candidate
-
observed PROJECT_TEST exit 1 ELIFECYCLE ×10 6.0.1 executionContext=node · moduleSystem=esm · os=windows · runtime=node@24.13 sha256:7711694d48fa…ELIFECYCLE Test failed. See above for more details.javascript/test-runner · test-runner-diagnostic · outer pnpm testEvidence quality: complete · Environment variants: 1 · First recorded: 2026-08-29 · Last seen: 2026-09-01
-
observed PROJECT_COMPILE exit 2 TS2307 ×8 6.0.1 → 7.1.2 executionContext=node · moduleSystem=cjs · os=windows · runtime=node@24.13 sha256:0470f88d95bb…lib/hooks/queries/index.ts(<n>,<n>): error TS2307: Cannot find module <str> or its corresponding type declarations. …typescript/tsc · compiler-diagnosticEvidence quality: complete · Environment variants: 1 · First recorded: 2026-09-01 · Last seen: 2026-09-01
-
observed PROJECT_COMPILE exit 2 TS7006 ×8 6.0.1 → 7.1.2 executionContext=node · moduleSystem=cjs · os=windows · runtime=node@24.13 sha256:21025cd78572…app/api/politicians/[id]/real-estates/route.ts(<n>,<n>): error TS7006: Parameter <str> implicitly has an <str> type. …typescript/tsc · compiler-diagnosticEvidence quality: complete · Environment variants: 1 · First recorded: 2026-09-01 · Last seen: 2026-09-01
-
observed PROJECT_COMPILE exit 2 TS2561 ×8 6.0.1 → 7.1.2 executionContext=node · moduleSystem=cjs · os=windows · runtime=node@24.13 sha256:5f96e966539e…app/api/politicians/[id]/real-estates/route.ts(<n>,<n>): error TS2561: Object literal may only specify known properties, but <str> does not exist in type …typescript/tsc · compiler-diagnosticEvidence quality: complete · Environment variants: 1 · First recorded: 2026-09-01 · Last seen: 2026-09-01
-
observed PROJECT_COMPILE exit 2 TS2345 ×8 6.0.1 → 7.1.2 executionContext=node · moduleSystem=cjs · os=windows · runtime=node@24.13 sha256:7e077f646acc…lib/api/real-estate-statistics.ts(<n>,<n>): error TS2345: Argument of type <str> is not assignable to parameter of type <str>.typescript/tsc · compiler-diagnosticEvidence quality: complete · Environment variants: 1 · First recorded: 2026-09-01 · Last seen: 2026-09-01
-
observed PROJECT_COMPILE exit 2 TS2551 ×8 6.0.1 → 7.1.2 executionContext=node · moduleSystem=cjs · os=windows · runtime=node@24.13 sha256:8a1ebc675f2b…app/api/politicians/[id]/real-estates/route.ts(<n>,<n>): error TS2551: Property <str> does not exist on type <str>. Did you mean <str>? …typescript/tsc · compiler-diagnosticEvidence quality: complete · Environment variants: 1 · First recorded: 2026-09-01 · Last seen: 2026-09-01
-
observed PROJECT_COMPILE exit 2 TS2339 ×8 6.0.1 → 7.1.2 executionContext=node · moduleSystem=cjs · os=windows · runtime=node@24.13 sha256:e51205820175…lib/api/real-estate-map-addresses.ts(<n>,<n>): error TS2339: Property <str> does not exist on type <str>.typescript/tsc · compiler-diagnosticEvidence quality: complete · Environment variants: 1 · First recorded: 2026-09-01 · Last seen: 2026-09-01
-
observed PROJECT_COMPILE exit 2 TS2305 ×8 6.0.1 → 7.1.2 executionContext=node · moduleSystem=cjs · os=windows · runtime=node@24.13 sha256:e7aa54217e13…app/api/politicians/[id]/real-estates/route.ts(<n>,<n>): error TS2305: Module <str> has no exported member <str>. …typescript/tsc · compiler-diagnosticEvidence quality: complete · Environment variants: 1 · First recorded: 2026-09-01 · Last seen: 2026-09-01
-
observed PROJECT_TEST ENOENT Evidence gap ×7 6.0.1 → 7.2.0 executionContext=node · os=windowsEvidence quality: legacy-evidence-incomplete · Environment variants: 4 · First recorded: 2026-08-18 · Last seen: 2026-08-25Diagnostic re-verification candidate
Showing the 12 most-reported of 299 recorded failure clusters. The rest are single reports.