Aufzeichnungennpmstrip-ansi6.0.1
Bedingungen ändern
Aktuelle Bedingungen
strip-ansi @6.0.1windows 11 · x64 · node 24 · pnpm 10 · node
Paketsumme, keine API
0 von 220 bestanden
Verifiziert — dieses Netzwerk hat an dieser Koordinate einen Contract ausgeführt.
hier gibt es ein Sample, und unser Lauf an dieser Koordinate ist fehlgeschlagen (1)
- Projektbeobachtungen
- 287 / 378
- Contract-Verifikationen
- 0 / 220
- Nutzungsdatensätze
- 1.206
- Unabhängig meldende Peers
- 1
- Fehlschläge mit erfasstem Fingerabdruck
- 90 / 91
- Zuletzt erfasst
- 2026-09-16
Abhängigkeits-Zustand
Beobachtete Kombinationen und Fehlernachweise für dieses Release
Erster beobachteter Fehler
6.0.1
windows · node@24.13 · moduleSystem=esm · executionContext=node
31 FAIL
· stage: UNKNOWN
· fingerprint: sha256:9f91c975308128a0f4f23e33b9d5936b9c39535b5c01aa9245b8cdc4b0a37a10
| Bibliothek | Version | Zustand | Dort gemessen | Projekte |
|---|---|---|---|---|
| ansi-regex | 5.0.1 | CANDIDATE Korrelierte Änderung; unbewiesene Kombination | Contract bestanden | 74 Projekttage |
Die Messspalte betrifft das Release der jeweiligen Abhängigkeit selbst, nicht das Paar. Dass ein Resolver zwei Releases nebeneinandergestellt hat, ist kein Beleg dafür, dass sie zusammen funktionieren.
Abhängigkeitsversionen über Releases
Worauf jedes Release dieses Pakets seine Kinder aufgelöst hat. Ein Kind, dessen Version sich bewegt hat, steht zuerst: dort hat ein Upgrade etwas unter Ihnen verändert.
| Bibliothek | 7.2.0 | 7.1.2 | 6.0.1 |
|---|---|---|---|
| ansi-regex | 6.2.2 | 6.2.2 | 5.0.1 |
Bewegt: 1 · in jedem Release gleich: 0
Eine Kante hält fest, dass ein Resolver auf einer echten Maschine ein Release neben ein anderes gestellt hat. Sie behauptet nicht, dass beide zusammen funktionieren; diese Frage beantworten Samples und Contracts, nicht das Vorhandensein einer Zeile.
Aktuelle Fehler-Cluster
-
beobachtet UNKNOWN exit 1 ERR_PNPM_RECURSIVE_RUN_FIRST_FAIL Beweislücke ×31 6.0.1 executionContext=node · moduleSystem=esm · os=windows · runtime=node@24.13 sha256:9f91c9753081…(node:<n>) ExperimentalWarning: SQLite is an experimental feature and might change at any time …pnpm · unclassified-diagnostic · outer pnpm · gap stage-unknownBeweisqualität: complete · Umgebungsvarianten: 1 · Zuerst erfasst: 2026-09-01 · Zuletzt gesehen: 2026-09-15Kandidat für diagnostische Neuprüfung
-
beobachtet UNKNOWN exit 1 ERR_PNPM_RECURSIVE_EXEC_FIRST_FAIL Beweislücke ×28 6.0.1 executionContext=node · moduleSystem=esm · os=windows · runtime=node@24.13 sha256:979755e6489d…(node:<n>) ExperimentalWarning: SQLite is an experimental feature and might change at any time …pnpm · unclassified-diagnostic · outer pnpm · gap stage-unknownBeweisqualität: complete · Umgebungsvarianten: 1 · Zuerst erfasst: 2026-09-01 · Zuletzt gesehen: 2026-09-15Kandidat für diagnostische Neuprüfung
-
beobachtet UNKNOWN exit 1 ERR_PNPM_RECURSIVE_EXEC_FIRST_FAIL Beweislücke ×11 6.0.1 executionContext=node · moduleSystem=esm · os=windows · runtime=node@24.13 sha256:73873d2c4aed…<str> is not recognized as an internal or external command, · operable program or batch file. · undefined …pnpm · unclassified-diagnostic · outer pnpm · gap stage-unknownBeweisqualität: complete · Umgebungsvarianten: 1 · Zuerst erfasst: 2026-09-01 · Zuletzt gesehen: 2026-09-01Kandidat für diagnostische Neuprüfung
-
beobachtet PROJECT_TEST exit 1 ELIFECYCLE ×10 6.0.1 executionContext=node · moduleSystem=esm · os=windows · runtime=node@24.13 sha256:7711694d48fa…ELIFECYCLE Test failed. See above for more details.javascript/test-runner · test-runner-diagnostic · outer pnpm testBeweisqualität: complete · Umgebungsvarianten: 1 · Zuerst erfasst: 2026-08-29 · Zuletzt gesehen: 2026-09-01
-
beobachtet PROJECT_COMPILE exit 2 TS2307 ×8 6.0.1 → 7.1.2 executionContext=node · moduleSystem=cjs · os=windows · runtime=node@24.13 sha256:0470f88d95bb…lib/hooks/queries/index.ts(<n>,<n>): error TS2307: Cannot find module <str> or its corresponding type declarations. …typescript/tsc · compiler-diagnosticBeweisqualität: complete · Umgebungsvarianten: 1 · Zuerst erfasst: 2026-09-01 · Zuletzt gesehen: 2026-09-01
-
beobachtet PROJECT_COMPILE exit 2 TS7006 ×8 6.0.1 → 7.1.2 executionContext=node · moduleSystem=cjs · os=windows · runtime=node@24.13 sha256:21025cd78572…app/api/politicians/[id]/real-estates/route.ts(<n>,<n>): error TS7006: Parameter <str> implicitly has an <str> type. …typescript/tsc · compiler-diagnosticBeweisqualität: complete · Umgebungsvarianten: 1 · Zuerst erfasst: 2026-09-01 · Zuletzt gesehen: 2026-09-01
-
beobachtet PROJECT_COMPILE exit 2 TS2561 ×8 6.0.1 → 7.1.2 executionContext=node · moduleSystem=cjs · os=windows · runtime=node@24.13 sha256:5f96e966539e…app/api/politicians/[id]/real-estates/route.ts(<n>,<n>): error TS2561: Object literal may only specify known properties, but <str> does not exist in type …typescript/tsc · compiler-diagnosticBeweisqualität: complete · Umgebungsvarianten: 1 · Zuerst erfasst: 2026-09-01 · Zuletzt gesehen: 2026-09-01
-
beobachtet PROJECT_COMPILE exit 2 TS2345 ×8 6.0.1 → 7.1.2 executionContext=node · moduleSystem=cjs · os=windows · runtime=node@24.13 sha256:7e077f646acc…lib/api/real-estate-statistics.ts(<n>,<n>): error TS2345: Argument of type <str> is not assignable to parameter of type <str>.typescript/tsc · compiler-diagnosticBeweisqualität: complete · Umgebungsvarianten: 1 · Zuerst erfasst: 2026-09-01 · Zuletzt gesehen: 2026-09-01
-
beobachtet PROJECT_COMPILE exit 2 TS2551 ×8 6.0.1 → 7.1.2 executionContext=node · moduleSystem=cjs · os=windows · runtime=node@24.13 sha256:8a1ebc675f2b…app/api/politicians/[id]/real-estates/route.ts(<n>,<n>): error TS2551: Property <str> does not exist on type <str>. Did you mean <str>? …typescript/tsc · compiler-diagnosticBeweisqualität: complete · Umgebungsvarianten: 1 · Zuerst erfasst: 2026-09-01 · Zuletzt gesehen: 2026-09-01
-
beobachtet PROJECT_COMPILE exit 2 TS2339 ×8 6.0.1 → 7.1.2 executionContext=node · moduleSystem=cjs · os=windows · runtime=node@24.13 sha256:e51205820175…lib/api/real-estate-map-addresses.ts(<n>,<n>): error TS2339: Property <str> does not exist on type <str>.typescript/tsc · compiler-diagnosticBeweisqualität: complete · Umgebungsvarianten: 1 · Zuerst erfasst: 2026-09-01 · Zuletzt gesehen: 2026-09-01
-
beobachtet PROJECT_COMPILE exit 2 TS2305 ×8 6.0.1 → 7.1.2 executionContext=node · moduleSystem=cjs · os=windows · runtime=node@24.13 sha256:e7aa54217e13…app/api/politicians/[id]/real-estates/route.ts(<n>,<n>): error TS2305: Module <str> has no exported member <str>. …typescript/tsc · compiler-diagnosticBeweisqualität: complete · Umgebungsvarianten: 1 · Zuerst erfasst: 2026-09-01 · Zuletzt gesehen: 2026-09-01
-
beobachtet PROJECT_TEST ENOENT Beweislücke ×7 6.0.1 → 7.2.0 executionContext=node · os=windowsBeweisqualität: legacy-evidence-incomplete · Umgebungsvarianten: 4 · Zuerst erfasst: 2026-08-18 · Zuletzt gesehen: 2026-08-25Kandidat für diagnostische Neuprüfung
Es werden die 12 meistgemeldeten von 299 aufgezeichneten Fehlerclustern gezeigt. Der Rest sind Einzelmeldungen.