Registrosnpmstring-width4.2.3
Mudar as condições
Condições atuais
string-width @4.2.3windows 11 · x64 · node 24 · pnpm 10 · node
total do pacote, não uma API
0 de 229 passaram
Verificado — esta rede executou um contrato nesta coordenada.
há uma amostra aqui e nossa execução nesta coordenada falhou (1)
- Observações de projetos
- 294 / 390
- Verificações de contrato
- 0 / 229
- Registros de uso
- 1.262
- Peers independentes que reportaram
- 1
- Falhas com impressão digital capturada
- 95 / 96
- Último registro
- 2026-09-26
Saúde das dependências
Combinações observadas e evidências de falha para esta versão
Primeira quebra observada
4.2.3
windows · node@24.13 · moduleSystem=esm · executionContext=node
32 FAIL
· stage: UNKNOWN
· fingerprint: sha256:9f91c975308128a0f4f23e33b9d5936b9c39535b5c01aa9245b8cdc4b0a37a10
| Biblioteca | Versão | Saúde | Medido ali | Projetos |
|---|---|---|---|---|
| emoji-regex | 8.0.0 | CANDIDATE Mudança correlacionada; combinação não comprovada | contrato aprovado | 87 dias-projeto |
| strip-ansi | 6.0.1 | CANDIDATE Mudança correlacionada; combinação não comprovada | contrato aprovado | 92 dias-projeto |
| is-fullwidth-code-point | 3.0.0 | PASS Todas as observações passaram | contrato aprovado | 84 dias-projeto |
A coluna de medição é sobre a versão de cada dependência em si, não sobre o par. Um resolvedor ter colocado duas versões lado a lado não é prova de que funcionam juntas.
Versões de dependências por versão
Para que cada versão deste pacote resolveu seus filhos. O filho cuja versão se moveu vem primeiro: foi ali que uma atualização mudou algo sob os seus pés.
| Biblioteca | 8.2.2 | 7.2.0 | 5.1.2 | 4.2.3 |
|---|---|---|---|---|
| emoji-regex | — | 10.6.0 | 9.2.2 | 8.0.0 |
| strip-ansi | 7.2.0 | 7.2.0 | 7.1.2 | 6.0.1 |
| eastasianwidth | — | — | 0.2.0 | — |
| get-east-asian-width | 1.6.0 | 1.6.0 | — | — |
| is-fullwidth-code-point | — | — | — | 3.0.0 |
Moveram-se: 2 · iguais em todas as versões: 3
Uma aresta registra que um resolvedor colocou uma versão ao lado de outra em uma máquina real. Não é uma afirmação de que as duas funcionam juntas; essa pergunta é respondida por amostras e contratos, não pela presença de uma linha.
Clusters de falha recentes
-
observado UNKNOWN exit 1 ERR_PNPM_RECURSIVE_RUN_FIRST_FAIL Lacuna de evidência ×32 4.2.3 executionContext=node · moduleSystem=esm · os=windows · runtime=node@24.13 sha256:9f91c9753081…(node:<n>) ExperimentalWarning: SQLite is an experimental feature and might change at any time …pnpm · unclassified-diagnostic · outer pnpm · gap stage-unknownQualidade da evidência: complete · Variantes de ambiente: 1 · Primeiro registro: 2026-09-01 · Visto por último: 2026-09-17Candidato a reverificação diagnóstica
-
observado UNKNOWN exit 1 ERR_PNPM_RECURSIVE_EXEC_FIRST_FAIL Lacuna de evidência ×28 4.2.3 executionContext=node · moduleSystem=esm · os=windows · runtime=node@24.13 sha256:979755e6489d…(node:<n>) ExperimentalWarning: SQLite is an experimental feature and might change at any time …pnpm · unclassified-diagnostic · outer pnpm · gap stage-unknownQualidade da evidência: complete · Variantes de ambiente: 1 · Primeiro registro: 2026-09-01 · Visto por último: 2026-09-15Candidato a reverificação diagnóstica
-
observado UNKNOWN exit 1 ERR_PNPM_RECURSIVE_EXEC_FIRST_FAIL Lacuna de evidência ×11 4.2.3 executionContext=node · moduleSystem=esm · os=windows · runtime=node@24.13 sha256:73873d2c4aed…<str> is not recognized as an internal or external command, · operable program or batch file. · undefined …pnpm · unclassified-diagnostic · outer pnpm · gap stage-unknownQualidade da evidência: complete · Variantes de ambiente: 1 · Primeiro registro: 2026-09-01 · Visto por último: 2026-09-01Candidato a reverificação diagnóstica
-
observado PROJECT_TEST exit 1 ELIFECYCLE ×10 4.2.3 executionContext=node · moduleSystem=esm · os=windows · runtime=node@24.13 sha256:7711694d48fa…ELIFECYCLE Test failed. See above for more details.javascript/test-runner · test-runner-diagnostic · outer pnpm testQualidade da evidência: complete · Variantes de ambiente: 1 · Primeiro registro: 2026-08-29 · Visto por último: 2026-09-01
-
observado PROJECT_COMPILE exit 2 TS2307 ×8 4.2.3 → 5.1.2 executionContext=node · moduleSystem=cjs · os=windows · runtime=node@24.13 sha256:0470f88d95bb…lib/hooks/queries/index.ts(<n>,<n>): error TS2307: Cannot find module <str> or its corresponding type declarations. …typescript/tsc · compiler-diagnosticQualidade da evidência: complete · Variantes de ambiente: 1 · Primeiro registro: 2026-09-01 · Visto por último: 2026-09-01
-
observado PROJECT_COMPILE exit 2 TS7006 ×8 4.2.3 → 5.1.2 executionContext=node · moduleSystem=cjs · os=windows · runtime=node@24.13 sha256:21025cd78572…app/api/politicians/[id]/real-estates/route.ts(<n>,<n>): error TS7006: Parameter <str> implicitly has an <str> type. …typescript/tsc · compiler-diagnosticQualidade da evidência: complete · Variantes de ambiente: 1 · Primeiro registro: 2026-09-01 · Visto por último: 2026-09-01
-
observado PROJECT_COMPILE exit 2 TS2561 ×8 4.2.3 → 5.1.2 executionContext=node · moduleSystem=cjs · os=windows · runtime=node@24.13 sha256:5f96e966539e…app/api/politicians/[id]/real-estates/route.ts(<n>,<n>): error TS2561: Object literal may only specify known properties, but <str> does not exist in type …typescript/tsc · compiler-diagnosticQualidade da evidência: complete · Variantes de ambiente: 1 · Primeiro registro: 2026-09-01 · Visto por último: 2026-09-01
-
observado PROJECT_COMPILE exit 2 TS2345 ×8 4.2.3 → 5.1.2 executionContext=node · moduleSystem=cjs · os=windows · runtime=node@24.13 sha256:7e077f646acc…lib/api/real-estate-statistics.ts(<n>,<n>): error TS2345: Argument of type <str> is not assignable to parameter of type <str>.typescript/tsc · compiler-diagnosticQualidade da evidência: complete · Variantes de ambiente: 1 · Primeiro registro: 2026-09-01 · Visto por último: 2026-09-01
-
observado PROJECT_COMPILE exit 2 TS2551 ×8 4.2.3 → 5.1.2 executionContext=node · moduleSystem=cjs · os=windows · runtime=node@24.13 sha256:8a1ebc675f2b…app/api/politicians/[id]/real-estates/route.ts(<n>,<n>): error TS2551: Property <str> does not exist on type <str>. Did you mean <str>? …typescript/tsc · compiler-diagnosticQualidade da evidência: complete · Variantes de ambiente: 1 · Primeiro registro: 2026-09-01 · Visto por último: 2026-09-01
-
observado PROJECT_COMPILE exit 2 TS2339 ×8 4.2.3 → 5.1.2 executionContext=node · moduleSystem=cjs · os=windows · runtime=node@24.13 sha256:e51205820175…lib/api/real-estate-map-addresses.ts(<n>,<n>): error TS2339: Property <str> does not exist on type <str>.typescript/tsc · compiler-diagnosticQualidade da evidência: complete · Variantes de ambiente: 1 · Primeiro registro: 2026-09-01 · Visto por último: 2026-09-01
-
observado PROJECT_COMPILE exit 2 TS2305 ×8 4.2.3 → 5.1.2 executionContext=node · moduleSystem=cjs · os=windows · runtime=node@24.13 sha256:e7aa54217e13…app/api/politicians/[id]/real-estates/route.ts(<n>,<n>): error TS2305: Module <str> has no exported member <str>. …typescript/tsc · compiler-diagnosticQualidade da evidência: complete · Variantes de ambiente: 1 · Primeiro registro: 2026-09-01 · Visto por último: 2026-09-01
-
observado PROJECT_TEST ENOENT Lacuna de evidência ×7 4.2.3 → 5.1.2 executionContext=node · os=windowsQualidade da evidência: legacy-evidence-incomplete · Variantes de ambiente: 4 · Primeiro registro: 2026-08-18 · Visto por último: 2026-08-25Candidato a reverificação diagnóstica
Mostrando os 12 mais relatados de 310 grupos de falhas registrados. O resto são relatos únicos.