Relevésnpmstring-width4.2.3
Changer les conditions
Conditions actuelles
string-width @4.2.3windows 11 · x64 · node 24 · pnpm 10 · node
total du paquet, pas une API
0 sur 220 ont réussi
Vérifié — ce réseau a exécuté un contrat à cette coordonnée.
il y a un échantillon ici et notre exécution à cette coordonnée a échoué (1)
- Observations de projets
- 287 / 378
- Vérifications de contrat
- 0 / 220
- Enregistrements d'usage
- 1 206
- Pairs rapporteurs indépendants
- 1
- Échecs avec empreinte capturée
- 90 / 91
- Dernier enregistrement
- 2026-09-16
Santé des dépendances
Combinaisons observées et preuves d'échec pour cette version
Premier échec observé
4.2.3
windows · node@24.13 · moduleSystem=esm · executionContext=node
31 FAIL
· stage: UNKNOWN
· fingerprint: sha256:9f91c975308128a0f4f23e33b9d5936b9c39535b5c01aa9245b8cdc4b0a37a10
| Bibliothèque | Version | Santé | Mesuré là-bas | Projets |
|---|---|---|---|---|
| emoji-regex | 8.0.0 | CANDIDATE Changement corrélé; combinaison non prouvée | contrat réussi | 71 jours-projet |
| strip-ansi | 6.0.1 | CANDIDATE Changement corrélé; combinaison non prouvée | contrat réussi | 76 jours-projet |
| is-fullwidth-code-point | 3.0.0 | PASS Toutes les observations ont réussi | contrat réussi | 68 jours-projet |
La colonne de mesure porte sur la version de chaque dépendance elle-même, pas sur la paire. Qu'un résolveur ait placé deux versions côte à côte ne prouve pas qu'elles fonctionnent ensemble.
Versions des dépendances au fil des versions
Ce vers quoi chaque version de ce paquet a résolu ses enfants. L'enfant dont la version a bougé vient en premier : c'est là qu'une mise à jour a changé quelque chose sous vos pieds.
| Bibliothèque | 8.2.2 | 7.2.0 | 5.1.2 | 4.2.3 |
|---|---|---|---|---|
| emoji-regex | — | 10.6.0 | 9.2.2 | 8.0.0 |
| strip-ansi | 7.2.0 | 7.2.0 | 7.1.2 | 6.0.1 |
| eastasianwidth | — | — | 0.2.0 | — |
| get-east-asian-width | 1.6.0 | 1.6.0 | — | — |
| is-fullwidth-code-point | — | — | — | 3.0.0 |
Ont bougé : 2 · identiques à chaque version : 3
Une arête indique qu'un résolveur a placé une version à côté d'une autre sur une machine réelle. Ce n'est pas une affirmation qu'elles fonctionnent ensemble ; à cette question répondent les échantillons et les contrats, pas la présence d'une ligne.
Clusters d'échecs récents
-
observé UNKNOWN exit 1 ERR_PNPM_RECURSIVE_RUN_FIRST_FAIL Lacune de preuve ×31 4.2.3 executionContext=node · moduleSystem=esm · os=windows · runtime=node@24.13 sha256:9f91c9753081…(node:<n>) ExperimentalWarning: SQLite is an experimental feature and might change at any time …pnpm · unclassified-diagnostic · outer pnpm · gap stage-unknownQualité de preuve: complete · Variantes d’environnement: 1 · Premier relevé: 2026-09-01 · Dernière observation: 2026-09-15Candidat à une revérification diagnostique
-
observé UNKNOWN exit 1 ERR_PNPM_RECURSIVE_EXEC_FIRST_FAIL Lacune de preuve ×28 4.2.3 executionContext=node · moduleSystem=esm · os=windows · runtime=node@24.13 sha256:979755e6489d…(node:<n>) ExperimentalWarning: SQLite is an experimental feature and might change at any time …pnpm · unclassified-diagnostic · outer pnpm · gap stage-unknownQualité de preuve: complete · Variantes d’environnement: 1 · Premier relevé: 2026-09-01 · Dernière observation: 2026-09-15Candidat à une revérification diagnostique
-
observé UNKNOWN exit 1 ERR_PNPM_RECURSIVE_EXEC_FIRST_FAIL Lacune de preuve ×11 4.2.3 executionContext=node · moduleSystem=esm · os=windows · runtime=node@24.13 sha256:73873d2c4aed…<str> is not recognized as an internal or external command, · operable program or batch file. · undefined …pnpm · unclassified-diagnostic · outer pnpm · gap stage-unknownQualité de preuve: complete · Variantes d’environnement: 1 · Premier relevé: 2026-09-01 · Dernière observation: 2026-09-01Candidat à une revérification diagnostique
-
observé PROJECT_TEST exit 1 ELIFECYCLE ×10 4.2.3 executionContext=node · moduleSystem=esm · os=windows · runtime=node@24.13 sha256:7711694d48fa…ELIFECYCLE Test failed. See above for more details.javascript/test-runner · test-runner-diagnostic · outer pnpm testQualité de preuve: complete · Variantes d’environnement: 1 · Premier relevé: 2026-08-29 · Dernière observation: 2026-09-01
-
observé PROJECT_COMPILE exit 2 TS2307 ×8 4.2.3 → 5.1.2 executionContext=node · moduleSystem=cjs · os=windows · runtime=node@24.13 sha256:0470f88d95bb…lib/hooks/queries/index.ts(<n>,<n>): error TS2307: Cannot find module <str> or its corresponding type declarations. …typescript/tsc · compiler-diagnosticQualité de preuve: complete · Variantes d’environnement: 1 · Premier relevé: 2026-09-01 · Dernière observation: 2026-09-01
-
observé PROJECT_COMPILE exit 2 TS7006 ×8 4.2.3 → 5.1.2 executionContext=node · moduleSystem=cjs · os=windows · runtime=node@24.13 sha256:21025cd78572…app/api/politicians/[id]/real-estates/route.ts(<n>,<n>): error TS7006: Parameter <str> implicitly has an <str> type. …typescript/tsc · compiler-diagnosticQualité de preuve: complete · Variantes d’environnement: 1 · Premier relevé: 2026-09-01 · Dernière observation: 2026-09-01
-
observé PROJECT_COMPILE exit 2 TS2561 ×8 4.2.3 → 5.1.2 executionContext=node · moduleSystem=cjs · os=windows · runtime=node@24.13 sha256:5f96e966539e…app/api/politicians/[id]/real-estates/route.ts(<n>,<n>): error TS2561: Object literal may only specify known properties, but <str> does not exist in type …typescript/tsc · compiler-diagnosticQualité de preuve: complete · Variantes d’environnement: 1 · Premier relevé: 2026-09-01 · Dernière observation: 2026-09-01
-
observé PROJECT_COMPILE exit 2 TS2345 ×8 4.2.3 → 5.1.2 executionContext=node · moduleSystem=cjs · os=windows · runtime=node@24.13 sha256:7e077f646acc…lib/api/real-estate-statistics.ts(<n>,<n>): error TS2345: Argument of type <str> is not assignable to parameter of type <str>.typescript/tsc · compiler-diagnosticQualité de preuve: complete · Variantes d’environnement: 1 · Premier relevé: 2026-09-01 · Dernière observation: 2026-09-01
-
observé PROJECT_COMPILE exit 2 TS2551 ×8 4.2.3 → 5.1.2 executionContext=node · moduleSystem=cjs · os=windows · runtime=node@24.13 sha256:8a1ebc675f2b…app/api/politicians/[id]/real-estates/route.ts(<n>,<n>): error TS2551: Property <str> does not exist on type <str>. Did you mean <str>? …typescript/tsc · compiler-diagnosticQualité de preuve: complete · Variantes d’environnement: 1 · Premier relevé: 2026-09-01 · Dernière observation: 2026-09-01
-
observé PROJECT_COMPILE exit 2 TS2339 ×8 4.2.3 → 5.1.2 executionContext=node · moduleSystem=cjs · os=windows · runtime=node@24.13 sha256:e51205820175…lib/api/real-estate-map-addresses.ts(<n>,<n>): error TS2339: Property <str> does not exist on type <str>.typescript/tsc · compiler-diagnosticQualité de preuve: complete · Variantes d’environnement: 1 · Premier relevé: 2026-09-01 · Dernière observation: 2026-09-01
-
observé PROJECT_COMPILE exit 2 TS2305 ×8 4.2.3 → 5.1.2 executionContext=node · moduleSystem=cjs · os=windows · runtime=node@24.13 sha256:e7aa54217e13…app/api/politicians/[id]/real-estates/route.ts(<n>,<n>): error TS2305: Module <str> has no exported member <str>. …typescript/tsc · compiler-diagnosticQualité de preuve: complete · Variantes d’environnement: 1 · Premier relevé: 2026-09-01 · Dernière observation: 2026-09-01
-
observé PROJECT_TEST ENOENT Lacune de preuve ×7 4.2.3 → 5.1.2 executionContext=node · os=windowsQualité de preuve: legacy-evidence-incomplete · Variantes d’environnement: 4 · Premier relevé: 2026-08-18 · Dernière observation: 2026-08-25Candidat à une revérification diagnostique
Affichage des 12 plus signalés parmi 299 groupes d’échecs enregistrés. Le reste sont des signalements uniques.