记录npmsocks2.8.10socks.SocksClient.createConnectionChain
更改条件
依赖健康度
此版本的依赖组合与失败观测
观测到问题 1 项 ·
变动 2 项 ·
正常 1 项
| 库 | 版本 | 健康状态 | 在那里测得 | 项目 |
|---|---|---|---|---|
| ip-address | 10.7.0 | CANDIDATE 相关变更;组合未证实 | 契约通过 | 28 个项目日 |
| ip-address | 10.7.4 | CANDIDATE 相关变更;组合未证实 | 契约通过 | 46 个项目日 |
| smart-buffer | 4.2.0 | PASS 所有观测均通过 | 契约通过 | 74 个项目日 |
测量列说的是每个依赖自身版本的情况,而不是这一对的情况。解析器把两个版本放在一起,并不证明它们能协同工作。
各版本的依赖版本
本包的每个版本把子依赖解析到了哪个版本。版本发生变动的子依赖排在最前:升级正是在那里改变了你脚下的东西。
| 库 | 2.8.10 | 2.8.9 | 2.8.7 |
|---|---|---|---|
| ip-address | 10.7.0 | 10.3.1 | 10.1.0 |
| smart-buffer | 4.2.0 | 4.2.0 | 4.2.0 |
发生变动:1 · 所有版本相同:1
一条边记录的是解析器在真实机器上把一个版本放在了另一个版本旁边。它并不主张两者能协同工作;那个问题由样本和契约回答,而不是由这里存在一行来回答。
近期失败聚类
-
已观测 UNKNOWN exit 1 证据缺口 ×2 2.8.10 executionContext=node · moduleSystem=esm · os=linux · runtime=node@22.23 sha256:536db39a2e08…<path>:<n> · const closeError = new Error(<str>) · ^ · Error: command failednpm · unclassified-diagnostic · outer npm test · gap stage-unknown证据质量: complete · 环境变体: 1 · 首次记录: 2026-10-18 · 最近观测: 2026-10-18诊断复验候选
-
已观测 UNKNOWN exit 1 ERR_ASSERTION 证据缺口 ×1 2.8.10 executionContext=node · moduleSystem=cjs · os=linux · runtime=node@22.23 sha256:0ab3a7004d66…node:assert:<n> · throw new AssertionError(obj); · ^ · AssertionError [ERR_ASSERTION]: Expected values to be strictly equal:node · unclassified-diagnostic · outer node · gap stage-unknown证据质量: complete · 环境变体: 1 · 首次记录: 2026-09-07 · 最近观测: 2026-09-07诊断复验候选
-
已观测 UNKNOWN exit 1 ERR_ASSERTION 证据缺口 ×1 2.8.10 executionContext=node · moduleSystem=cjs · os=linux · runtime=node@22.23 sha256:0d62cac8c07a…AssertionError [ERR_ASSERTION]: Expected values to be strictly equal: · + actual - expected · + <str> · - <str>node · unclassified-diagnostic · outer node · gap stage-unknown证据质量: complete · 环境变体: 1 · 首次记录: 2026-09-07 · 最近观测: 2026-09-07诊断复验候选
-
已观测 UNKNOWN exit 1 ERR_ASSERTION 证据缺口 ×1 2.8.10 executionContext=node · moduleSystem=cjs · os=linux · runtime=node@22.23 sha256:719dc399517f…AssertionError [ERR_ASSERTION]: Expected values to be strictly equal: · 8080 !== 38853 · at runTests (<path>:<n>:<n>) …node · unclassified-diagnostic · outer node · gap stage-unknown证据质量: complete · 环境变体: 1 · 首次记录: 2026-09-07 · 最近观测: 2026-09-07诊断复验候选
-
已观测 UNKNOWN exit 1 ERR_ASSERTION 证据缺口 ×1 2.8.10 executionContext=node · moduleSystem=cjs · os=linux · runtime=node@22.23 sha256:821bb102fcd0…node:assert:<n> · throw err; · ^ · AssertionError [ERR_ASSERTION]: The input did not match the regular expression <path> of the internal SmartBuffer/. Input:node · unclassified-diagnostic · outer node · gap stage-unknown证据质量: complete · 环境变体: 1 · 首次记录: 2026-09-07 · 最近观测: 2026-09-07诊断复验候选
-
已观测 UNKNOWN exit 1 ERR_ASSERTION 证据缺口 ×1 2.8.10 executionContext=node · moduleSystem=cjs · os=linux · runtime=node@22.23 sha256:cf0f5652a811…Contract test failed: AssertionError [ERR_ASSERTION]: should reject non-connect command · at async testContract (<url>) { · generatedMessage: false, …node · unclassified-diagnostic · outer node · gap stage-unknown证据质量: complete · 环境变体: 1 · 首次记录: 2026-09-07 · 最近观测: 2026-09-07诊断复验候选
-
已观测 UNKNOWN exit 1 证据缺口 ×1 2.8.10 executionContext=node · moduleSystem=esm · os=linux · runtime=node@22.23 sha256:a327536006a1…<url> · import { getAgent, Agent, HttpAgent, HttpsAgent, cache } from <str>; · ^^^^^ …npm · unclassified-diagnostic · outer npm test · gap stage-unknown证据质量: complete · 环境变体: 1 · 首次记录: 2026-10-17 · 最近观测: 2026-10-17诊断复验候选
-
已观测 PROJECT_TEST exit 1 ERR_ASSERTION ×1 2.8.10 executionContext=node · moduleSystem=esm · os=linux · runtime=node@22.23 sha256:4904e63e5296…AssertionError [ERR_ASSERTION]: Expected values to be strictly equal: · + actual - expected · + <str> · - <str>javascript/test-runner · test-runner-diagnostic · outer npm test证据质量: complete · 环境变体: 1 · 首次记录: 2026-10-18 · 最近观测: 2026-10-18
-
已观测 PROJECT_TEST exit 1 ERR_ASSERTION ×1 2.8.10 executionContext=node · moduleSystem=esm · os=linux · runtime=node@22.23 sha256:8c3539be02dd…AssertionError [ERR_ASSERTION]: Expected values to be strictly deep-equal: · + actual - expected · Comparison { · + message: <str>,javascript/test-runner · test-runner-diagnostic · outer npm test证据质量: complete · 环境变体: 1 · 首次记录: 2026-10-18 · 最近观测: 2026-10-18
-
已观测 PROJECT_TEST exit 1 ERR_ASSERTION ×1 2.8.10 executionContext=node · moduleSystem=esm · os=linux · runtime=node@22.23 sha256:ccb20bbc5842…AssertionError [ERR_ASSERTION]: Expected values to be strictly equal: · + actual - expected · + undefined · - <str>javascript/test-runner · test-runner-diagnostic · outer npm test证据质量: complete · 环境变体: 1 · 首次记录: 2026-10-18 · 最近观测: 2026-10-18
-
已观测 UNKNOWN exit 1 证据缺口 ×1 2.8.10 executionContext=node · moduleSystem=esm · os=linux · runtime=node@22.23 sha256:5cb8e084fdab…<path>:<n> · throw new error_1.UnsignedMetadataError(`${delegatedRole} was signed by ${signingKeys.size}/${role.threshold} keys`); · ^ …node · unclassified-diagnostic · outer node · gap stage-unknown证据质量: complete · 环境变体: 1 · 首次记录: 2026-10-18 · 最近观测: 2026-10-18诊断复验候选