Recordsnpmsocks2.8.10SocksClient.createConnection
Change the conditions
Current conditions
SocksClient.createConnection @2.8.10debian glibc · x64 · node 22 · npm · node
1 of 1 passed
Verified — this network ran a contract at this coordinate.
there is a sample here, and our run of it at this coordinate came back clean (1)
- Project observations
- 1 / 1
- Contract verifications
- 1 / 1
- Independent reporting peers
- 1
- Last recorded
- 2026-09-17
Dependency Health
Observed combinations and failure evidence for this release
First observed break
2.8.10
linux · node@22.23 · moduleSystem=cjs · executionContext=node
1 FAIL
· stage: UNKNOWN
· fingerprint: sha256:0ab3a7004d66a92c85914b849316be1df344d8cf5f6a68edd66909ad7c806d71
| Library | Version | Health | Measured there | Projects |
|---|---|---|---|---|
| ip-address | 10.7.0 | CANDIDATE Correlated change; unproven combination | contract passed | 28 project-days |
| ip-address | 10.7.4 | CANDIDATE Correlated change; unproven combination | contract passed | 23 project-days |
| smart-buffer | 4.2.0 | PASS All observations passed | contract passed | 51 project-days |
The measured column is about each dependency's own release, not about the pair. A resolver placing two releases side by side is not evidence that they work together.
Dependency versions across releases
What each release of this package resolved its children to. A child whose version moved is listed first: that is where an upgrade changed something underneath you.
| Library | 2.8.10 | 2.8.9 | 2.8.7 |
|---|---|---|---|
| ip-address | 10.7.4 | 10.3.1 | 10.1.0 |
| smart-buffer | 4.2.0 | 4.2.0 | 4.2.0 |
Moved: 1 · unchanged at every release: 1
An edge records that a resolver placed one release beside another on a real machine. It is not a claim that the two work together; that question is answered by samples and contracts, not by presence here.
Recent failure clusters
-
observed UNKNOWN exit 1 ERR_ASSERTION Evidence gap ×1 2.8.10 executionContext=node · moduleSystem=cjs · os=linux · runtime=node@22.23 sha256:0ab3a7004d66…node:assert:<n> · throw new AssertionError(obj); · ^ · AssertionError [ERR_ASSERTION]: Expected values to be strictly equal:node · unclassified-diagnostic · outer node · gap stage-unknownEvidence quality: complete · Environment variants: 1 · First recorded: 2026-09-07 · Last seen: 2026-09-07Diagnostic re-verification candidate
-
observed UNKNOWN exit 1 ERR_ASSERTION Evidence gap ×1 2.8.10 executionContext=node · moduleSystem=cjs · os=linux · runtime=node@22.23 sha256:0d62cac8c07a…AssertionError [ERR_ASSERTION]: Expected values to be strictly equal: · + actual - expected · + <str> · - <str>node · unclassified-diagnostic · outer node · gap stage-unknownEvidence quality: complete · Environment variants: 1 · First recorded: 2026-09-07 · Last seen: 2026-09-07Diagnostic re-verification candidate
-
observed UNKNOWN exit 1 ERR_ASSERTION Evidence gap ×1 2.8.10 executionContext=node · moduleSystem=cjs · os=linux · runtime=node@22.23 sha256:719dc399517f…AssertionError [ERR_ASSERTION]: Expected values to be strictly equal: · 8080 !== 38853 · at runTests (<path>:<n>:<n>) …node · unclassified-diagnostic · outer node · gap stage-unknownEvidence quality: complete · Environment variants: 1 · First recorded: 2026-09-07 · Last seen: 2026-09-07Diagnostic re-verification candidate
-
observed UNKNOWN exit 1 ERR_ASSERTION Evidence gap ×1 2.8.10 executionContext=node · moduleSystem=cjs · os=linux · runtime=node@22.23 sha256:821bb102fcd0…node:assert:<n> · throw err; · ^ · AssertionError [ERR_ASSERTION]: The input did not match the regular expression <path> of the internal SmartBuffer/. Input:node · unclassified-diagnostic · outer node · gap stage-unknownEvidence quality: complete · Environment variants: 1 · First recorded: 2026-09-07 · Last seen: 2026-09-07Diagnostic re-verification candidate
-
observed UNKNOWN exit 1 ERR_ASSERTION Evidence gap ×1 2.8.10 executionContext=node · moduleSystem=cjs · os=linux · runtime=node@22.23 sha256:cf0f5652a811…Contract test failed: AssertionError [ERR_ASSERTION]: should reject non-connect command · at async testContract (<url>) { · generatedMessage: false, …node · unclassified-diagnostic · outer node · gap stage-unknownEvidence quality: complete · Environment variants: 1 · First recorded: 2026-09-07 · Last seen: 2026-09-07Diagnostic re-verification candidate
-
observed UNKNOWN exit 1 Evidence gap ×1 2.8.10 executionContext=node · moduleSystem=esm · os=linux · runtime=node@22.23 sha256:a327536006a1…<url> · import { getAgent, Agent, HttpAgent, HttpsAgent, cache } from <str>; · ^^^^^ …npm · unclassified-diagnostic · outer npm test · gap stage-unknownEvidence quality: complete · Environment variants: 1 · First recorded: 2026-10-17 · Last seen: 2026-10-17Diagnostic re-verification candidate
-
observed UNKNOWN exit 1 Evidence gap ×1 2.8.10 executionContext=node · moduleSystem=esm · os=linux · runtime=node@22.23 sha256:536db39a2e08…<path>:<n> · const closeError = new Error(<str>) · ^ · Error: command failednpm · unclassified-diagnostic · outer npm test · gap stage-unknownEvidence quality: complete · Environment variants: 1 · First recorded: 2026-10-18 · Last seen: 2026-10-18Diagnostic re-verification candidate