Записиnpmsignal-exit4.1.0
Изменить условия
Текущие условия
signal-exit @4.1.0debian glibc · x64 · node 22 · npm · node
итог по пакету, а не API
2 из 2 прошли
Проверено — эта сеть выполнила контракт в этой координате.
образец есть — наш запуск в этой координате завершился чисто (2)
- Наблюдения в проектах
- 2 / 2
- Проверки контрактом
- 2 / 2
- Записи об использовании
- 2
- Независимые сообщившие пиры
- 1
- Последняя запись
- 2026-09-08
Свидетельства, которые можно открыть
Здоровье зависимостей
Разрешение прочитало дерево этого релиза и не нашло зависимостей. Это измерение, а не его отсутствие.
Недавние кластеры сбоев
-
наблюдалось UNKNOWN exit 1 ERR_ASSERTION Пробел в данных ×3 3.0.7 → 4.1.0 executionContext=node · os=linux · runtime=node@22.23 sha256:986d98189e70…node:internal/modules/run_main:<n> · triggerUncaughtException( · ^ · AssertionError [ERR_ASSERTION]: Expected values to be strictly equal:node · unclassified-diagnostic · outer node · gap stage-unknownКачество данных: complete · Варианты среды: 2 · Первая запись: 2026-08-30 · Последнее наблюдение: 2026-10-20Кандидат на диагностическую перепроверку
-
наблюдалось UNKNOWN exit 1 ERR_ASSERTION Пробел в данных ×3 4.1.0 executionContext=node · os=linux · runtime=node@22.23 sha256:43caf7a060e7…node:internal/modules/run_main:<n> · triggerUncaughtException( · ^ · AssertionError [ERR_ASSERTION]: Expected values to be strictly deep-equal:node · unclassified-diagnostic · outer node · gap stage-unknownКачество данных: complete · Варианты среды: 2 · Первая запись: 2026-10-21 · Последнее наблюдение: 2026-10-21Кандидат на диагностическую перепроверку
-
наблюдалось UNKNOWN exit 1 Пробел в данных ×2 3.0.7 → 4.1.0 executionContext=node · moduleSystem=esm · os=linux · runtime=node@22.23 sha256:795cbb5ee086…Error: Cannot find module <str> · Require stack: · - <path> · - <path>node · unclassified-diagnostic · outer node · gap stage-unknownКачество данных: complete · Варианты среды: 1 · Первая запись: 2026-08-30 · Последнее наблюдение: 2026-08-30Кандидат на диагностическую перепроверку
-
наблюдалось UNKNOWN exit 1 ERR_ASSERTION Пробел в данных ×2 3.0.7 → 4.1.0 executionContext=node · moduleSystem=esm · os=linux · runtime=node@22.23 sha256:054c93088b95…node:internal/modules/run_main:<n> · triggerUncaughtException( · ^ …node · unclassified-diagnostic · outer node · gap stage-unknownКачество данных: complete · Варианты среды: 1 · Первая запись: 2026-08-31 · Последнее наблюдение: 2026-08-31Кандидат на диагностическую перепроверку
-
наблюдалось UNKNOWN exit 1 ERR_ASSERTION Пробел в данных ×2 3.0.7 → 4.1.0 executionContext=node · moduleSystem=cjs · os=linux · runtime=node@22.23 sha256:a878372dcfe9…AssertionError [ERR_ASSERTION]: getVersion must return 30.4.2 · <str> !== <str> · at main (<path>:<n>:<n>) · at Object.<anonymous> (<path>:<n>:<n>)node · unclassified-diagnostic · outer node · gap stage-unknownКачество данных: complete · Варианты среды: 1 · Первая запись: 2026-08-31 · Последнее наблюдение: 2026-08-31Кандидат на диагностическую перепроверку
-
наблюдалось UNKNOWN exit 1 Пробел в данных ×2 4.1.0 executionContext=node · moduleSystem=esm · os=linux · runtime=node@22.23 sha256:536db39a2e08…<path>:<n> · const closeError = new Error(<str>) · ^ · Error: command failednpm · unclassified-diagnostic · outer npm test · gap stage-unknownКачество данных: complete · Варианты среды: 1 · Первая запись: 2026-10-18 · Последнее наблюдение: 2026-10-18Кандидат на диагностическую перепроверку
-
наблюдалось PROJECT_TEST exit 1 ERR_ASSERTION ×2 4.1.0 executionContext=node · moduleSystem=esm · os=linux · runtime=node@22.23 sha256:4904e63e5296…AssertionError [ERR_ASSERTION]: Expected values to be strictly equal: · + actual - expected · + <str> · - <str>javascript/test-runner · test-runner-diagnostic · outer npm testКачество данных: complete · Варианты среды: 1 · Первая запись: 2026-10-18 · Последнее наблюдение: 2026-10-20
-
наблюдалось PROJECT_TEST exit 1 ERR_ASSERTION ×2 4.1.0 executionContext=node · moduleSystem=esm · os=linux · runtime=node@22.23 sha256:ccb20bbc5842…AssertionError [ERR_ASSERTION]: Expected values to be strictly equal: · + actual - expected · + undefined · - <str>javascript/test-runner · test-runner-diagnostic · outer npm testКачество данных: complete · Варианты среды: 1 · Первая запись: 2026-10-18 · Последнее наблюдение: 2026-10-21
-
наблюдалось UNKNOWN exit 1 Пробел в данных ×1 4.1.0 executionContext=node · moduleSystem=cjs · os=linux · runtime=node@22.23 sha256:edf45b86def1…<path>:<n> · throw new Error(<str>); · ^ · Error: Do not import `@jest/globals` outside of the Jest test environmentnode · unclassified-diagnostic · outer node · gap stage-unknownКачество данных: complete · Варианты среды: 1 · Первая запись: 2026-08-31 · Последнее наблюдение: 2026-08-31Кандидат на диагностическую перепроверку
-
наблюдалось UNKNOWN exit 1 ERR_PACKAGE_PATH_NOT_EXPORTED Пробел в данных ×1 4.1.0 executionContext=node · moduleSystem=esm · os=linux · runtime=node@22.23 sha256:b9a7518ba7bb…node:internal/modules/esm/resolve:<n> · return new ERR_PACKAGE_PATH_NOT_EXPORTED( · ^ …node · unclassified-diagnostic · outer node · gap stage-unknownКачество данных: complete · Варианты среды: 1 · Первая запись: 2026-09-01 · Последнее наблюдение: 2026-09-01Кандидат на диагностическую перепроверку
-
наблюдалось UNKNOWN exit 13 Пробел в данных ×1 4.1.0 executionContext=node · moduleSystem=esm · os=linux · runtime=node@22.23 sha256:4a939d00eec4…Warning: Detected unsettled top-level await at <url>]:<n> · const ans = await promptPromise; · ^ · fil<path>:<n>node · unclassified-diagnostic · outer node · gap stage-unknownКачество данных: complete · Варианты среды: 1 · Первая запись: 2026-09-16 · Последнее наблюдение: 2026-09-16Кандидат на диагностическую перепроверку
-
наблюдалось UNKNOWN exit 1 ERR_ASSERTION Пробел в данных ×1 4.1.0 executionContext=node · moduleSystem=cjs · os=linux · runtime=node@22.23 sha256:b12460008ca6…Test failed: AssertionError [ERR_ASSERTION]: Expected values to be strictly equal: · true !== false · at runTests (<url>) · at <url>node · unclassified-diagnostic · outer node · gap stage-unknownКачество данных: complete · Варианты среды: 1 · Первая запись: 2026-09-16 · Последнее наблюдение: 2026-09-16Кандидат на диагностическую перепроверку
Показаны 12 наиболее часто сообщаемых из 23 записанных кластеров отказов. Остальные — единичные сообщения.