Registrosnpmsignal-exit4.1.0
Cambiar las condiciones
Condiciones actuales
signal-exit @4.1.0alpine musl · x64 · node 22 · npm · node
total del paquete, no una API
2 de 2 pasaron
Verificado: esta red ejecutó un contrato en esta coordenada.
hay una muestra aquí y nuestra ejecución en esta coordenada terminó limpia (2)
- Observaciones de proyectos
- 4 / 4
- Verificaciones de contrato
- 2 / 2
- Registros de uso
- 2
- Peers independientes que reportaron
- 1
- Último registro
- 2026-08-30
Evidencia que puedes abrir
Salud de dependencias
Una resolución leyó el árbol de esta versión y no encontró dependencias. Es una medición, no una que falte.
Clústeres de fallos recientes
-
observado UNKNOWN exit 1 ERR_ASSERTION Brecha de evidencia ×3 3.0.7 → 4.1.0 executionContext=node · os=linux · runtime=node@22.23 sha256:986d98189e70…node:internal/modules/run_main:<n> · triggerUncaughtException( · ^ · AssertionError [ERR_ASSERTION]: Expected values to be strictly equal:node · unclassified-diagnostic · outer node · gap stage-unknownCalidad de evidencia: complete · Variantes de entorno: 2 · Primer registro: 2026-08-30 · Última observación: 2026-10-20Candidato a reverificación diagnóstica
-
observado UNKNOWN exit 1 ERR_ASSERTION Brecha de evidencia ×3 4.1.0 executionContext=node · os=linux · runtime=node@22.23 sha256:43caf7a060e7…node:internal/modules/run_main:<n> · triggerUncaughtException( · ^ · AssertionError [ERR_ASSERTION]: Expected values to be strictly deep-equal:node · unclassified-diagnostic · outer node · gap stage-unknownCalidad de evidencia: complete · Variantes de entorno: 2 · Primer registro: 2026-10-21 · Última observación: 2026-10-21Candidato a reverificación diagnóstica
-
observado UNKNOWN exit 1 Brecha de evidencia ×2 3.0.7 → 4.1.0 executionContext=node · moduleSystem=esm · os=linux · runtime=node@22.23 sha256:795cbb5ee086…Error: Cannot find module <str> · Require stack: · - <path> · - <path>node · unclassified-diagnostic · outer node · gap stage-unknownCalidad de evidencia: complete · Variantes de entorno: 1 · Primer registro: 2026-08-30 · Última observación: 2026-08-30Candidato a reverificación diagnóstica
-
observado UNKNOWN exit 1 ERR_ASSERTION Brecha de evidencia ×2 3.0.7 → 4.1.0 executionContext=node · moduleSystem=esm · os=linux · runtime=node@22.23 sha256:054c93088b95…node:internal/modules/run_main:<n> · triggerUncaughtException( · ^ …node · unclassified-diagnostic · outer node · gap stage-unknownCalidad de evidencia: complete · Variantes de entorno: 1 · Primer registro: 2026-08-31 · Última observación: 2026-08-31Candidato a reverificación diagnóstica
-
observado UNKNOWN exit 1 ERR_ASSERTION Brecha de evidencia ×2 3.0.7 → 4.1.0 executionContext=node · moduleSystem=cjs · os=linux · runtime=node@22.23 sha256:a878372dcfe9…AssertionError [ERR_ASSERTION]: getVersion must return 30.4.2 · <str> !== <str> · at main (<path>:<n>:<n>) · at Object.<anonymous> (<path>:<n>:<n>)node · unclassified-diagnostic · outer node · gap stage-unknownCalidad de evidencia: complete · Variantes de entorno: 1 · Primer registro: 2026-08-31 · Última observación: 2026-08-31Candidato a reverificación diagnóstica
-
observado UNKNOWN exit 1 Brecha de evidencia ×2 4.1.0 executionContext=node · moduleSystem=esm · os=linux · runtime=node@22.23 sha256:536db39a2e08…<path>:<n> · const closeError = new Error(<str>) · ^ · Error: command failednpm · unclassified-diagnostic · outer npm test · gap stage-unknownCalidad de evidencia: complete · Variantes de entorno: 1 · Primer registro: 2026-10-18 · Última observación: 2026-10-18Candidato a reverificación diagnóstica
-
observado PROJECT_TEST exit 1 ERR_ASSERTION ×2 4.1.0 executionContext=node · moduleSystem=esm · os=linux · runtime=node@22.23 sha256:4904e63e5296…AssertionError [ERR_ASSERTION]: Expected values to be strictly equal: · + actual - expected · + <str> · - <str>javascript/test-runner · test-runner-diagnostic · outer npm testCalidad de evidencia: complete · Variantes de entorno: 1 · Primer registro: 2026-10-18 · Última observación: 2026-10-20
-
observado PROJECT_TEST exit 1 ERR_ASSERTION ×2 4.1.0 executionContext=node · moduleSystem=esm · os=linux · runtime=node@22.23 sha256:ccb20bbc5842…AssertionError [ERR_ASSERTION]: Expected values to be strictly equal: · + actual - expected · + undefined · - <str>javascript/test-runner · test-runner-diagnostic · outer npm testCalidad de evidencia: complete · Variantes de entorno: 1 · Primer registro: 2026-10-18 · Última observación: 2026-10-21
-
observado UNKNOWN exit 1 Brecha de evidencia ×1 4.1.0 executionContext=node · moduleSystem=cjs · os=linux · runtime=node@22.23 sha256:edf45b86def1…<path>:<n> · throw new Error(<str>); · ^ · Error: Do not import `@jest/globals` outside of the Jest test environmentnode · unclassified-diagnostic · outer node · gap stage-unknownCalidad de evidencia: complete · Variantes de entorno: 1 · Primer registro: 2026-08-31 · Última observación: 2026-08-31Candidato a reverificación diagnóstica
-
observado UNKNOWN exit 1 ERR_PACKAGE_PATH_NOT_EXPORTED Brecha de evidencia ×1 4.1.0 executionContext=node · moduleSystem=esm · os=linux · runtime=node@22.23 sha256:b9a7518ba7bb…node:internal/modules/esm/resolve:<n> · return new ERR_PACKAGE_PATH_NOT_EXPORTED( · ^ …node · unclassified-diagnostic · outer node · gap stage-unknownCalidad de evidencia: complete · Variantes de entorno: 1 · Primer registro: 2026-09-01 · Última observación: 2026-09-01Candidato a reverificación diagnóstica
-
observado UNKNOWN exit 13 Brecha de evidencia ×1 4.1.0 executionContext=node · moduleSystem=esm · os=linux · runtime=node@22.23 sha256:4a939d00eec4…Warning: Detected unsettled top-level await at <url>]:<n> · const ans = await promptPromise; · ^ · fil<path>:<n>node · unclassified-diagnostic · outer node · gap stage-unknownCalidad de evidencia: complete · Variantes de entorno: 1 · Primer registro: 2026-09-16 · Última observación: 2026-09-16Candidato a reverificación diagnóstica
-
observado UNKNOWN exit 1 ERR_ASSERTION Brecha de evidencia ×1 4.1.0 executionContext=node · moduleSystem=cjs · os=linux · runtime=node@22.23 sha256:b12460008ca6…Test failed: AssertionError [ERR_ASSERTION]: Expected values to be strictly equal: · true !== false · at runTests (<url>) · at <url>node · unclassified-diagnostic · outer node · gap stage-unknownCalidad de evidencia: complete · Variantes de entorno: 1 · Primer registro: 2026-09-16 · Última observación: 2026-09-16Candidato a reverificación diagnóstica
Se muestran los 12 más reportados de 23 grupos de fallos registrados. El resto son reportes únicos.