记录npmsemver7.7.4
更改条件
依赖健康度
某次解析读取了该版本的依赖树,没有发现依赖。这是一次测量结果,而不是缺失。
近期失败聚类
-
已观测 UNKNOWN exit 1 证据缺口 ×36 5.7.2 → 6.3.1 → 7.7.4 → 7.8.5 executionContext=node · moduleSystem=cjs · os=linux · runtime=node@22.23 sha256:9be950af9140…Traceback (most recent call last): · File <str>, line 1, in <module> · ModuleNotFoundError: No module named <str>python3 · unclassified-diagnostic · outer python3 · gap stage-unknown证据质量: complete · 环境变体: 1 · 首次记录: 2026-08-30 · 最近观测: 2026-08-31诊断复验候选
-
已观测 UNKNOWN exit 1 证据缺口 ×27 5.7.2 → 6.3.1 → 7.7.4 → 7.8.5 executionContext=node · moduleSystem=cjs · os=linux · runtime=node@22.23 sha256:91ad26545eb1…node:internal/modules/cjs/loader:<n> · throw err; · ^ · Error: Cannot find module <str>node · unclassified-diagnostic · outer node · gap stage-unknown证据质量: complete · 环境变体: 1 · 首次记录: 2026-08-29 · 最近观测: 2026-09-06诊断复验候选
-
已观测 PROCESS_START process start failed 证据缺口 ×22 5.7.2 → 6.3.1 → 7.7.4 → 7.8.5 executionContext=node sha256:c12549970456…· structured-termination · gap diagnostic-missing证据质量: partial · 环境变体: 2 · 首次记录: 2026-08-30 · 最近观测: 2026-09-16诊断复验候选
-
已观测 UNKNOWN exit 1 ERR_MODULE_NOT_FOUND 证据缺口 ×14 5.7.2 → 6.3.1 → 7.7.4 → 7.8.5 executionContext=node · os=linux · runtime=node@22.23 sha256:88af852f99a8…node:internal/modules/package_json_reader:<n> · throw new ERR_MODULE_NOT_FOUND(packageName, fileURLToPath(base), null); · ^ …node · unclassified-diagnostic · outer node · gap stage-unknown证据质量: complete · 环境变体: 2 · 首次记录: 2026-08-29 · 最近观测: 2026-09-05诊断复验候选
-
已观测 PROJECT_TEST ENOENT 证据缺口 ×11 5.7.2 → 6.3.1 → 7.7.4 → 7.8.5 executionContext=node证据质量: legacy-evidence-incomplete · 环境变体: 5 · 首次记录: 2026-08-18 · 最近观测: 2026-09-07诊断复验候选
-
已观测 UNKNOWN exit 1 证据缺口 ×3 5.7.2 → 7.7.4 → 7.8.5 executionContext=node · os=linux · runtime=node@22.23 sha256:8310a83be884…node:internal/modules/cjs/loader:<n> · const err = new Error(message); · ^ · Error: Cannot find module <str>node · unclassified-diagnostic · outer node · gap stage-unknown证据质量: complete · 环境变体: 2 · 首次记录: 2026-08-29 · 最近观测: 2026-09-05诊断复验候选
-
已观测 UNKNOWN exit 1 ERR_ASSERTION 证据缺口 ×3 5.7.2 → 6.3.1 → 7.7.4 executionContext=node · moduleSystem=cjs · os=linux · runtime=node@22.23 sha256:0d62cac8c07a…AssertionError [ERR_ASSERTION]: Expected values to be strictly equal: · + actual - expected · + <str> · - <str>node · unclassified-diagnostic · outer node · gap stage-unknown证据质量: complete · 环境变体: 1 · 首次记录: 2026-08-30 · 最近观测: 2026-08-30诊断复验候选
-
已观测 UNKNOWN exit 1 证据缺口 ×3 5.7.2 → 6.3.1 → 7.7.4 executionContext=node · moduleSystem=cjs · os=linux · runtime=node@22.23 sha256:e1d65fc7c136…<path>:<n> · throw new Error(`Unsupported arch ${name}`) · ^ · Error: Unsupported arch 1node · unclassified-diagnostic · outer node · gap stage-unknown证据质量: complete · 环境变体: 1 · 首次记录: 2026-08-30 · 最近观测: 2026-08-30诊断复验候选
-
已观测 PROJECT_TEST exit 1 ERR_ASSERTION ×2 7.7.4 executionContext=node · moduleSystem=cjs · os=linux · runtime=node@22.23 sha256:45fc70285a65…Contract test failed: AssertionError [ERR_ASSERTION]: DOWNLOAD_PROGRESS event should have fired · false !== true · at main (<path>:<n>:<n>) { …javascript/test-runner · test-runner-diagnostic · outer npm test证据质量: complete · 环境变体: 1 · 首次记录: 2026-08-29 · 最近观测: 2026-08-29
-
已观测 UNKNOWN exit 1 证据缺口 ×2 5.7.2 → 7.7.4 executionContext=node · moduleSystem=cjs · os=linux · runtime=node@22.23 sha256:9922ca80f240…go: <path> already existsgo · unclassified-diagnostic · outer go mod · gap stage-unknown证据质量: complete · 环境变体: 1 · 首次记录: 2026-08-29 · 最近观测: 2026-08-29诊断复验候选
-
已观测 UNKNOWN exit 1 ERR_ASSERTION 证据缺口 ×2 5.7.2 → 7.7.4 executionContext=node · moduleSystem=cjs · os=linux · runtime=node@22.23 sha256:07e974cf28d4…Test failed: AssertionError [ERR_ASSERTION]: getFeedURL should return configured feed url · + actual - expected · + <str> · - <str>node · unclassified-diagnostic · outer node · gap stage-unknown证据质量: complete · 环境变体: 1 · 首次记录: 2026-08-30 · 最近观测: 2026-08-31诊断复验候选
-
已观测 UNKNOWN exit 1 证据缺口 ×2 5.7.2 → 7.7.4 executionContext=node · moduleSystem=cjs · os=linux · runtime=node@22.23 sha256:1c03ca490615…Traceback (most recent call last): · File <str>, line 3, in <module> · AttributeError: module <str> has no attribute <str> · IANA_VERSION: <str>python · unclassified-diagnostic · outer python · gap stage-unknown证据质量: complete · 环境变体: 1 · 首次记录: 2026-08-30 · 最近观测: 2026-08-31诊断复验候选
显示报告最多的 12 个。此坐标记录的失败聚类共 16 个。其余为单次报告。