Aufzeichnungennpmrollup4.63.1
Bedingungen ändern
Aktuelle Bedingungen
rollup @4.63.1debian glibc · x64 · node 22 · npm · node
Paketsumme, keine API
Als in Projekten vorhanden erfasst. An dieser Koordinate wurde nichts ausgeführt.
Beobachtet — echte Projekt-Builds haben von dieser Koordinate berichtet.
an dieser Koordinate noch kein Sample
- Projektbeobachtungen
- nichts an dieser Koordinate
- Contract-Verifikationen
- nichts an dieser Koordinate
- Nutzungsdatensätze
- 13
- Unabhängig meldende Peers
- 1
- Zuletzt erfasst
- 2026-09-10
Abhängigkeits-Zustand
Beobachtete Kombinationen und Fehlernachweise für dieses Release
Erster beobachteter Fehler
4.63.1
executionContext=node
40 FAIL
· stage: PROCESS_START
· fingerprint: sha256:c12549970456efb5abdc90b679695c6689107d4f097d612245d6bfb25e01ec32
| Bibliothek | Version | Zustand | Dort gemessen | Projekte |
|---|---|---|---|---|
| @types/estree | 1.0.9 | CANDIDATE Korrelierte Änderung; unbewiesene Kombination | Contract bestanden | 71 Projekttage |
Die Messspalte betrifft das Release der jeweiligen Abhängigkeit selbst, nicht das Paar. Dass ein Resolver zwei Releases nebeneinandergestellt hat, ist kein Beleg dafür, dass sie zusammen funktionieren.
Abhängigkeitsversionen über Releases
Worauf jedes Release dieses Pakets seine Kinder aufgelöst hat. Ein Kind, dessen Version sich bewegt hat, steht zuerst: dort hat ein Upgrade etwas unter Ihnen verändert.
| Bibliothek | 4.63.3 | 4.63.2 | 4.63.1 | 4.63.0 | 4.62.5 | 4.62.4 | 4.62.3 | 4.54.0 | 4.34.8 | 4.24.0 |
|---|---|---|---|---|---|---|---|---|---|---|
| @types/estree | 1.0.9 | 1.0.9 | 1.0.9 | 1.0.9 | 1.0.9 | 1.0.9 | 1.0.9 | 1.0.8 | 1.0.6 | 1.0.6 |
Bewegt: 1 · in jedem Release gleich: 0
Eine Kante hält fest, dass ein Resolver auf einer echten Maschine ein Release neben ein anderes gestellt hat. Sie behauptet nicht, dass beide zusammen funktionieren; diese Frage beantworten Samples und Contracts, nicht das Vorhandensein einer Zeile.
Aktuelle Fehler-Cluster
-
beobachtet PROCESS_START process start failed Beweislücke ×40 4.62.4 → 4.63.0 → 4.63.1 → 4.63.2 executionContext=node sha256:c12549970456…· structured-termination · gap diagnostic-missingBeweisqualität: partial · Umgebungsvarianten: 3 · Zuerst erfasst: 2026-08-31 · Zuletzt gesehen: 2026-09-16Kandidat für diagnostische Neuprüfung
-
beobachtet UNKNOWN exit 1 ERR_MODULE_NOT_FOUND Beweislücke ×5 4.63.1 → 4.63.2 executionContext=node · moduleSystem=cjs · os=linux · runtime=node@22.23 sha256:88af852f99a8…node:internal/modules/package_json_reader:<n> · throw new ERR_MODULE_NOT_FOUND(packageName, fileURLToPath(base), null); · ^ …node · unclassified-diagnostic · outer node · gap stage-unknownBeweisqualität: complete · Umgebungsvarianten: 1 · Zuerst erfasst: 2026-09-03 · Zuletzt gesehen: 2026-09-14Kandidat für diagnostische Neuprüfung
-
beobachtet UNKNOWN exit 1 ERR_ASSERTION Beweislücke ×4 4.63.1 executionContext=node · os=linux · runtime=node@22.23 sha256:986d98189e70…node:internal/modules/run_main:<n> · triggerUncaughtException( · ^ · AssertionError [ERR_ASSERTION]: Expected values to be strictly equal:node · unclassified-diagnostic · outer node · gap stage-unknownBeweisqualität: complete · Umgebungsvarianten: 2 · Zuerst erfasst: 2026-09-03 · Zuletzt gesehen: 2026-09-05Kandidat für diagnostische Neuprüfung
-
beobachtet UNKNOWN exit 1 Beweislücke ×3 4.63.1 executionContext=node · moduleSystem=esm · os=linux · runtime=node@22.23 sha256:8fd30f2a6304…fil<path>:<n> · throw new Error(errorMsg); · ^ · Error: Vitest failed to access its internal state.node · unclassified-diagnostic · outer node · gap stage-unknownBeweisqualität: complete · Umgebungsvarianten: 1 · Zuerst erfasst: 2026-08-31 · Zuletzt gesehen: 2026-09-08Kandidat für diagnostische Neuprüfung
-
beobachtet UNKNOWN exit 1 Beweislücke ×2 4.63.0 → 4.63.1 executionContext=node · moduleSystem=cjs · os=linux · runtime=node@22.23 sha256:91ad26545eb1…node:internal/modules/cjs/loader:<n> · throw err; · ^ · Error: Cannot find module <str>node · unclassified-diagnostic · outer node · gap stage-unknownBeweisqualität: complete · Umgebungsvarianten: 1 · Zuerst erfasst: 2026-08-31 · Zuletzt gesehen: 2026-09-07Kandidat für diagnostische Neuprüfung
-
beobachtet UNKNOWN exit 1 Beweislücke ×1 4.63.1 executionContext=node · moduleSystem=cjs · os=linux · runtime=node@22.23 sha256:0cd3a66e3ae2…Contract failed: Error: Unexpected require: <path> · at mockRequire (<url>) · at eval (eval at evaluateCjs (<url>), <anonymous>:<n>:<n>) …node · unclassified-diagnostic · outer node · gap stage-unknownBeweisqualität: complete · Umgebungsvarianten: 1 · Zuerst erfasst: 2026-09-03 · Zuletzt gesehen: 2026-09-03Kandidat für diagnostische Neuprüfung
-
beobachtet UNKNOWN exit 1 Beweislücke ×1 4.63.1 executionContext=node · moduleSystem=cjs · os=linux · runtime=node@22.23 sha256:b4964cdcf3b0…Contract failed: Error: Unexpected require: external-dep-b · at mockRequire (<url>) · at eval (eval at evaluateCjs (<url>), <anonymous>:<n>:<n>) …node · unclassified-diagnostic · outer node · gap stage-unknownBeweisqualität: complete · Umgebungsvarianten: 1 · Zuerst erfasst: 2026-09-03 · Zuletzt gesehen: 2026-09-03Kandidat für diagnostische Neuprüfung
-
beobachtet UNKNOWN exit 1 Beweislücke ×1 4.63.1 executionContext=node · moduleSystem=esm · os=linux · runtime=node@22.23 sha256:42623a56826f…fil<path>:<n> · Object.defineProperty(expect.not, expectAssertionName, { · ^ · TypeError: Object.defineProperty called on non-objectnode · unclassified-diagnostic · outer node · gap stage-unknownBeweisqualität: complete · Umgebungsvarianten: 1 · Zuerst erfasst: 2026-09-04 · Zuletzt gesehen: 2026-09-04Kandidat für diagnostische Neuprüfung
-
beobachtet UNKNOWN exit 1 ERROR Beweislücke ×1 4.63.1 executionContext=node · moduleSystem=cjs · os=linux · runtime=node@22.23 sha256:1f882fb2e944…✘ [ERROR] Could not resolve <str> · failed to load config from <path> · <path>:<n> · let error = new Error(text);node · unclassified-diagnostic · outer node · gap stage-unknownBeweisqualität: complete · Umgebungsvarianten: 1 · Zuerst erfasst: 2026-09-04 · Zuletzt gesehen: 2026-09-04Kandidat für diagnostische Neuprüfung
-
beobachtet UNKNOWN exit 1 ERR_ASSERTION Beweislücke ×1 4.63.1 executionContext=node · moduleSystem=esm · os=linux · runtime=node@22.23 sha256:ac1a96fa941c…Contract test failed: AssertionError [ERR_ASSERTION]: out/preload/index.js must be created by build · at run (<url>) { · generatedMessage: false, …node · unclassified-diagnostic · outer node · gap stage-unknownBeweisqualität: complete · Umgebungsvarianten: 1 · Zuerst erfasst: 2026-09-06 · Zuletzt gesehen: 2026-09-06Kandidat für diagnostische Neuprüfung
-
beobachtet UNKNOWN exit 1 Beweislücke ×1 4.63.1 executionContext=node · moduleSystem=cjs · os=linux · runtime=node@22.23 sha256:148f04041544…atomic: true, · followSymlinks: true, · awaitWriteFinish: false · },node · unclassified-diagnostic · outer node · gap stage-unknownBeweisqualität: complete · Umgebungsvarianten: 1 · Zuerst erfasst: 2026-09-07 · Zuletzt gesehen: 2026-09-07Kandidat für diagnostische Neuprüfung
-
beobachtet UNKNOWN exit 1 ERR_ASSERTION Beweislücke ×1 4.63.1 executionContext=node · moduleSystem=esm · os=linux · runtime=node@22.23 sha256:43caf7a060e7…node:internal/modules/run_main:<n> · triggerUncaughtException( · ^ · AssertionError [ERR_ASSERTION]: Expected values to be strictly deep-equal:node · unclassified-diagnostic · outer node · gap stage-unknownBeweisqualität: complete · Umgebungsvarianten: 1 · Zuerst erfasst: 2026-09-07 · Zuletzt gesehen: 2026-09-07Kandidat für diagnostische Neuprüfung
Es werden die 12 meistgemeldeten von 19 aufgezeichneten Fehlerclustern gezeigt. Der Rest sind Einzelmeldungen.