Registrosnpmrollup4.63.1rollup.rollup
Mudar as condições
Condições atuais
rollup.rollup @4.63.1ubuntu glibc · x64 · node 22 · npm 10 · node
0 de 7 passaram
Verificado — esta rede executou um contrato nesta coordenada.
há uma amostra aqui e nossa execução nesta coordenada falhou
- Observações de projetos
- 10 / 10
- Verificações de contrato
- 0 / 7
- Peers independentes que reportaram
- 2
- Último registro
- 2026-09-03
Saúde das dependências
Combinações observadas e evidências de falha para esta versão
Primeira quebra observada
4.63.1
executionContext=node
40 FAIL
· stage: PROCESS_START
· fingerprint: sha256:c12549970456efb5abdc90b679695c6689107d4f097d612245d6bfb25e01ec32
| Biblioteca | Versão | Saúde | Medido ali | Projetos |
|---|---|---|---|---|
| @types/estree | 1.0.9 | CANDIDATE Mudança correlacionada; combinação não comprovada | contrato aprovado | 71 dias-projeto |
A coluna de medição é sobre a versão de cada dependência em si, não sobre o par. Um resolvedor ter colocado duas versões lado a lado não é prova de que funcionam juntas.
Versões de dependências por versão
Para que cada versão deste pacote resolveu seus filhos. O filho cuja versão se moveu vem primeiro: foi ali que uma atualização mudou algo sob os seus pés.
| Biblioteca | 4.63.3 | 4.63.2 | 4.63.1 | 4.63.0 | 4.62.5 | 4.62.4 | 4.62.3 | 4.54.0 | 4.34.8 | 4.24.0 |
|---|---|---|---|---|---|---|---|---|---|---|
| @types/estree | 1.0.9 | 1.0.9 | 1.0.9 | 1.0.9 | 1.0.9 | 1.0.9 | 1.0.9 | 1.0.8 | 1.0.6 | 1.0.6 |
Moveram-se: 1 · iguais em todas as versões: 0
Uma aresta registra que um resolvedor colocou uma versão ao lado de outra em uma máquina real. Não é uma afirmação de que as duas funcionam juntas; essa pergunta é respondida por amostras e contratos, não pela presença de uma linha.
Clusters de falha recentes
-
observado PROCESS_START process start failed Lacuna de evidência ×40 4.62.4 → 4.63.0 → 4.63.1 → 4.63.2 executionContext=node sha256:c12549970456…· structured-termination · gap diagnostic-missingQualidade da evidência: partial · Variantes de ambiente: 3 · Primeiro registro: 2026-08-31 · Visto por último: 2026-09-16Candidato a reverificação diagnóstica
-
observado UNKNOWN exit 1 ERR_MODULE_NOT_FOUND Lacuna de evidência ×5 4.63.1 → 4.63.2 executionContext=node · moduleSystem=cjs · os=linux · runtime=node@22.23 rollup.rollup sha256:88af852f99a8…node:internal/modules/package_json_reader:<n> · throw new ERR_MODULE_NOT_FOUND(packageName, fileURLToPath(base), null); · ^ …node · unclassified-diagnostic · outer node · gap stage-unknownQualidade da evidência: complete · Variantes de ambiente: 1 · Primeiro registro: 2026-09-03 · Visto por último: 2026-09-14Candidato a reverificação diagnóstica
-
observado UNKNOWN exit 1 ERR_ASSERTION Lacuna de evidência ×4 4.63.1 executionContext=node · os=linux · runtime=node@22.23 sha256:986d98189e70…node:internal/modules/run_main:<n> · triggerUncaughtException( · ^ · AssertionError [ERR_ASSERTION]: Expected values to be strictly equal:node · unclassified-diagnostic · outer node · gap stage-unknownQualidade da evidência: complete · Variantes de ambiente: 2 · Primeiro registro: 2026-09-03 · Visto por último: 2026-09-05Candidato a reverificação diagnóstica
-
observado UNKNOWN exit 1 Lacuna de evidência ×3 4.63.1 executionContext=node · moduleSystem=esm · os=linux · runtime=node@22.23 sha256:8fd30f2a6304…fil<path>:<n> · throw new Error(errorMsg); · ^ · Error: Vitest failed to access its internal state.node · unclassified-diagnostic · outer node · gap stage-unknownQualidade da evidência: complete · Variantes de ambiente: 1 · Primeiro registro: 2026-08-31 · Visto por último: 2026-09-08Candidato a reverificação diagnóstica
-
observado UNKNOWN exit 1 Lacuna de evidência ×2 4.63.0 → 4.63.1 executionContext=node · moduleSystem=cjs · os=linux · runtime=node@22.23 sha256:91ad26545eb1…node:internal/modules/cjs/loader:<n> · throw err; · ^ · Error: Cannot find module <str>node · unclassified-diagnostic · outer node · gap stage-unknownQualidade da evidência: complete · Variantes de ambiente: 1 · Primeiro registro: 2026-08-31 · Visto por último: 2026-09-07Candidato a reverificação diagnóstica
-
observado UNKNOWN exit 1 ERR_ASSERTION Lacuna de evidência ×2 4.63.1 executionContext=node · moduleSystem=cjs · os=linux · runtime=node@22.23 rollup.rollup sha256:986d98189e70…node:internal/modules/run_main:<n> · triggerUncaughtException( · ^ · AssertionError [ERR_ASSERTION]: Expected values to be strictly equal:node · unclassified-diagnostic · outer node · gap stage-unknownQualidade da evidência: complete · Variantes de ambiente: 1 · Primeiro registro: 2026-09-03 · Visto por último: 2026-09-03Candidato a reverificação diagnóstica
-
observado UNKNOWN exit 1 Lacuna de evidência ×1 4.63.1 executionContext=node · moduleSystem=cjs · os=linux · runtime=node@22.23 rollup.rollup sha256:0cd3a66e3ae2…Contract failed: Error: Unexpected require: <path> · at mockRequire (<url>) · at eval (eval at evaluateCjs (<url>), <anonymous>:<n>:<n>) …node · unclassified-diagnostic · outer node · gap stage-unknownQualidade da evidência: complete · Variantes de ambiente: 1 · Primeiro registro: 2026-09-03 · Visto por último: 2026-09-03Candidato a reverificação diagnóstica
-
observado UNKNOWN exit 1 Lacuna de evidência ×1 4.63.1 executionContext=node · moduleSystem=cjs · os=linux · runtime=node@22.23 rollup.rollup sha256:b4964cdcf3b0…Contract failed: Error: Unexpected require: external-dep-b · at mockRequire (<url>) · at eval (eval at evaluateCjs (<url>), <anonymous>:<n>:<n>) …node · unclassified-diagnostic · outer node · gap stage-unknownQualidade da evidência: complete · Variantes de ambiente: 1 · Primeiro registro: 2026-09-03 · Visto por último: 2026-09-03Candidato a reverificação diagnóstica
-
observado UNKNOWN exit 1 Lacuna de evidência ×1 4.63.1 executionContext=node · moduleSystem=esm · os=linux · runtime=node@22.23 sha256:42623a56826f…fil<path>:<n> · Object.defineProperty(expect.not, expectAssertionName, { · ^ · TypeError: Object.defineProperty called on non-objectnode · unclassified-diagnostic · outer node · gap stage-unknownQualidade da evidência: complete · Variantes de ambiente: 1 · Primeiro registro: 2026-09-04 · Visto por último: 2026-09-04Candidato a reverificação diagnóstica
-
observado UNKNOWN exit 1 ERROR Lacuna de evidência ×1 4.63.1 executionContext=node · moduleSystem=cjs · os=linux · runtime=node@22.23 sha256:1f882fb2e944…✘ [ERROR] Could not resolve <str> · failed to load config from <path> · <path>:<n> · let error = new Error(text);node · unclassified-diagnostic · outer node · gap stage-unknownQualidade da evidência: complete · Variantes de ambiente: 1 · Primeiro registro: 2026-09-04 · Visto por último: 2026-09-04Candidato a reverificação diagnóstica
-
observado UNKNOWN exit 1 ERR_ASSERTION Lacuna de evidência ×1 4.63.1 executionContext=node · moduleSystem=esm · os=linux · runtime=node@22.23 sha256:ac1a96fa941c…Contract test failed: AssertionError [ERR_ASSERTION]: out/preload/index.js must be created by build · at run (<url>) { · generatedMessage: false, …node · unclassified-diagnostic · outer node · gap stage-unknownQualidade da evidência: complete · Variantes de ambiente: 1 · Primeiro registro: 2026-09-06 · Visto por último: 2026-09-06Candidato a reverificação diagnóstica
-
observado UNKNOWN exit 1 Lacuna de evidência ×1 4.63.1 executionContext=node · moduleSystem=cjs · os=linux · runtime=node@22.23 sha256:148f04041544…atomic: true, · followSymlinks: true, · awaitWriteFinish: false · },node · unclassified-diagnostic · outer node · gap stage-unknownQualidade da evidência: complete · Variantes de ambiente: 1 · Primeiro registro: 2026-09-07 · Visto por último: 2026-09-07Candidato a reverificação diagnóstica
Mostrando os 12 mais relatados de 20 grupos de falhas registrados. O resto são relatos únicos.