Recordsnpmresponselike2.0.1Response
Change the conditions
Current conditions
Response @2.0.1alpine musl · x64 · node 22 · npm · node
1 of 1 passed
Verified — this network ran a contract at this coordinate.
there is a sample here, and our run of it at this coordinate came back clean (1)
- Project observations
- nothing at this coordinate
- Contract verifications
- 1 / 1
- Last recorded
- 2026-08-28
Dependency Health
Observed combinations and failure evidence for this release
First observed break
2.0.1
windows · node@24.13 · moduleSystem=esm · executionContext=node
32 FAIL
· stage: UNKNOWN
· fingerprint: sha256:9f91c975308128a0f4f23e33b9d5936b9c39535b5c01aa9245b8cdc4b0a37a10
| Library | Version | Health | Measured there | Projects |
|---|---|---|---|---|
| lowercase-keys | 2.0.0 | PASS All observations passed | contract passed | 56 project-days |
The measured column is about each dependency's own release, not about the pair. A resolver placing two releases side by side is not evidence that they work together.
Recent failure clusters
-
observed UNKNOWN exit 1 Evidence gap ×25 2.0.1 executionContext=node · moduleSystem=cjs · os=linux · runtime=node@22.23 sha256:9be950af9140…Traceback (most recent call last): · File <str>, line 1, in <module> · ModuleNotFoundError: No module named <str>python3 · unclassified-diagnostic · outer python3 · gap stage-unknownEvidence quality: complete · Environment variants: 1 · First recorded: 2026-08-30 · Last seen: 2026-09-02Diagnostic re-verification candidate
-
observed PROCESS_START process start failed Evidence gap ×9 2.0.1 executionContext=node sha256:c12549970456…· structured-termination · gap diagnostic-missingEvidence quality: partial · Environment variants: 2 · First recorded: 2026-08-30 · Last seen: 2026-09-16Diagnostic re-verification candidate
-
observed UNKNOWN exit 1 Evidence gap ×6 2.0.1 executionContext=node · moduleSystem=cjs · os=linux · runtime=node@22.23 sha256:72ba2d1e946f…<path>: No module named pippython3 · unclassified-diagnostic · outer python3 · gap stage-unknownEvidence quality: complete · Environment variants: 1 · First recorded: 2026-08-31 · Last seen: 2026-09-02Diagnostic re-verification candidate
-
observed PROJECT_PROCESS Evidence gap ×4 2.0.1 executionContext=node · moduleSystem=cjs · os=linux · runtime=node@22.23Evidence quality: legacy-evidence-incomplete · Environment variants: 1 · First recorded: 2026-08-29 · Last seen: 2026-08-29Diagnostic re-verification candidate
-
observed UNKNOWN exit 2 Evidence gap ×4 2.0.1 executionContext=node · moduleSystem=cjs · os=linux · runtime=node@22.23 sha256:fddf8ea09045…Using CPython 3.12.3 interpreter at: <path> · Creating virtual environment at: .venv · error: Failed to create virtual environment …· unclassified-diagnostic · gap stage-unknownEvidence quality: complete · Environment variants: 1 · First recorded: 2026-08-30 · Last seen: 2026-08-31Diagnostic re-verification candidate
-
observed UNKNOWN exit 1 Evidence gap ×3 2.0.1 executionContext=node · moduleSystem=cjs · os=linux · runtime=node@22.23 sha256:91ad26545eb1…node:internal/modules/cjs/loader:<n> · throw err; · ^ · Error: Cannot find module <str>node · unclassified-diagnostic · outer node · gap stage-unknownEvidence quality: complete · Environment variants: 1 · First recorded: 2026-08-30 · Last seen: 2026-08-31Diagnostic re-verification candidate
-
observed UNKNOWN exit 1 ERR_ASSERTION Evidence gap ×3 2.0.1 executionContext=node · moduleSystem=cjs · os=linux · runtime=node@22.23 sha256:986d98189e70…node:internal/modules/run_main:<n> · triggerUncaughtException( · ^ · AssertionError [ERR_ASSERTION]: Expected values to be strictly equal:node · unclassified-diagnostic · outer node · gap stage-unknownEvidence quality: complete · Environment variants: 1 · First recorded: 2026-08-30 · Last seen: 2026-09-02Diagnostic re-verification candidate
-
observed UNKNOWN exit 1 Evidence gap ×3 2.0.1 executionContext=node · moduleSystem=cjs · os=linux · runtime=node@22.23 sha256:7789edf7d3db…<path> · <path> · <path>· unclassified-diagnostic · gap stage-unknownEvidence quality: complete · Environment variants: 1 · First recorded: 2026-08-31 · Last seen: 2026-09-02Diagnostic re-verification candidate
-
observed UNKNOWN exit 2 Evidence gap ×2 2.0.1 executionContext=node · moduleSystem=cjs · os=linux · runtime=node@22.23 sha256:5bb159dc4015…usage: -c [-h] [--port int] · -c: error: unrecognized arguments: -p 4000· unclassified-diagnostic · gap stage-unknownEvidence quality: complete · Environment variants: 1 · First recorded: 2026-09-02 · Last seen: 2026-09-02Diagnostic re-verification candidate
-
observed UNKNOWN exit 2 EVERYTHING Evidence gap ×2 2.0.1 executionContext=node · moduleSystem=cjs · os=linux · runtime=node@22.23 sha256:d29a2deca319…csx sample: unknown subcommand <str> · usage: csx sample <subcommand> · propose --goal G [--package purl]... [--symbol s]... …· unclassified-diagnostic · gap stage-unknownEvidence quality: complete · Environment variants: 1 · First recorded: 2026-09-02 · Last seen: 2026-09-02Diagnostic re-verification candidate
-
observed UNKNOWN exit 1 Evidence gap ×1 2.0.1 executionContext=node · moduleSystem=cjs · os=linux · runtime=node@22.23 sha256:6370f8688b49…Contract test failed: Error: Cannot find module <str> · Require stack: · - <path> · - <path>node · unclassified-diagnostic · outer node · gap stage-unknownEvidence quality: complete · Environment variants: 1 · First recorded: 2026-08-29 · Last seen: 2026-08-29Diagnostic re-verification candidate
-
observed UNKNOWN exit 1 ERR_ASSERTION Evidence gap ×1 2.0.1 executionContext=node · moduleSystem=cjs · os=linux · runtime=node@22.23 sha256:f326878dcad5…AssertionError [ERR_ASSERTION]: App declaration must contain <str> method · at runTests (<path>:<n>:<n>) · at Object.<anonymous> (<path>:<n>:<n>) …node · unclassified-diagnostic · outer node · gap stage-unknownEvidence quality: complete · Environment variants: 1 · First recorded: 2026-08-29 · Last seen: 2026-08-29Diagnostic re-verification candidate
Showing the 12 most-reported of 52 recorded failure clusters. The rest are single reports.