Записиnpmreact-refresh0.17.0react-refresh._getMountedRootCount
Изменить условия
Текущие условия
react-refresh._getMountedRootCount @0.17.0debian glibc · x64 · node 22 · npm · node
1 из 1 прошли
Проверено — эта сеть выполнила контракт в этой координате.
образец есть — наш запуск в этой координате завершился чисто (1)
- Наблюдения в проектах
- 1 / 1
- Проверки контрактом
- 1 / 1
- Независимые сообщившие пиры
- 1
- Последняя запись
- 2026-09-17
Свидетельства, которые можно открыть
Здоровье зависимостей
Разрешение прочитало дерево этого релиза и не нашло зависимостей. Это измерение, а не его отсутствие.
Недавние кластеры сбоев
-
наблюдалось UNKNOWN exit 1 Пробел в данных ×3 0.17.0 → 0.18.0 executionContext=node · moduleSystem=cjs · os=linux · runtime=node@22.23 sha256:91ad26545eb1…node:internal/modules/cjs/loader:<n> · throw err; · ^ · Error: Cannot find module <str>node · unclassified-diagnostic · outer node · gap stage-unknownКачество данных: complete · Варианты среды: 1 · Первая запись: 2026-09-04 · Последнее наблюдение: 2026-09-06Кандидат на диагностическую перепроверку
-
наблюдалось PROCESS_START process start failed Пробел в данных ×3 0.17.0 executionContext=node sha256:c12549970456…· structured-termination · gap diagnostic-missingКачество данных: partial · Варианты среды: 2 · Первая запись: 2026-09-05 · Последнее наблюдение: 2026-09-16Кандидат на диагностическую перепроверку
-
наблюдалось PROJECT_RESOLVE exit 1 ×1 0.17.0 executionContext=node · moduleSystem=cjs · os=linux · runtime=node@22.23 sha256:15e1b71df43a…test_contract.go:<n>:<n>: no required module provides package golang.org/x/text/unicode/norm: go.mod file not found in current directory or any parent …go/module · resolve-diagnostic · outer go runКачество данных: complete · Варианты среды: 1 · Первая запись: 2026-09-05 · Последнее наблюдение: 2026-09-05
-
наблюдалось UNKNOWN exit 1 Пробел в данных ×1 0.17.0 executionContext=node · moduleSystem=cjs · os=linux · runtime=node@22.23 sha256:138a106a5937…stat main.go: no such file or directorygo · unclassified-diagnostic · outer go run · gap stage-unknownКачество данных: complete · Варианты среды: 1 · Первая запись: 2026-09-05 · Последнее наблюдение: 2026-09-05Кандидат на диагностическую перепроверку
-
наблюдалось UNKNOWN exit 1 Пробел в данных ×1 0.17.0 executionContext=node · moduleSystem=cjs · os=linux · runtime=node@22.23 sha256:3b3190f2cd44…doc: cannot find package <str> in any of: · ($GOROOT not set) · <path> (from $GOPATH)go · unclassified-diagnostic · outer go · gap stage-unknownКачество данных: complete · Варианты среды: 1 · Первая запись: 2026-09-05 · Последнее наблюдение: 2026-09-05Кандидат на диагностическую перепроверку
-
наблюдалось UNKNOWN exit 1 Пробел в данных ×1 0.17.0 executionContext=node · moduleSystem=cjs · os=linux · runtime=node@22.23 sha256:aff813d6d5e0…go: go.mod file not found in current directory or any parent directory; see <str>go · unclassified-diagnostic · outer go run · gap stage-unknownКачество данных: complete · Варианты среды: 1 · Первая запись: 2026-09-05 · Последнее наблюдение: 2026-09-05Кандидат на диагностическую перепроверку
-
наблюдалось UNKNOWN exit 1 Пробел в данных ×1 0.17.0 executionContext=node · moduleSystem=cjs · os=linux · runtime=node@22.23 sha256:69ab38336834…assertion 1 failed: expected text/plain; version=0.0.4; charset=utf-8, got text/plain; version=0.0.4; charset=utf-8; escaping=underscores · exit status 1go · unclassified-diagnostic · outer go run · gap stage-unknownКачество данных: complete · Варианты среды: 1 · Первая запись: 2026-09-05 · Последнее наблюдение: 2026-09-05Кандидат на диагностическую перепроверку
-
наблюдалось UNKNOWN exit 1 ERR_ASSERTION Пробел в данных ×1 0.17.0 executionContext=node · moduleSystem=cjs · os=linux · runtime=node@22.23 sha256:761ce8fa9777…node:assert:<n> · throw new AssertionError(obj); · ^ · AssertionError [ERR_ASSERTION]: Should yield 4 tokens for const answer = 42;node · unclassified-diagnostic · outer node · gap stage-unknownКачество данных: complete · Варианты среды: 1 · Первая запись: 2026-09-05 · Последнее наблюдение: 2026-09-05Кандидат на диагностическую перепроверку
-
наблюдалось UNKNOWN exit 1 ERR_MODULE_NOT_FOUND Пробел в данных ×1 0.17.0 executionContext=node · moduleSystem=cjs · os=linux · runtime=node@22.23 sha256:88af852f99a8…node:internal/modules/package_json_reader:<n> · throw new ERR_MODULE_NOT_FOUND(packageName, fileURLToPath(base), null); · ^ …node · unclassified-diagnostic · outer node · gap stage-unknownКачество данных: complete · Варианты среды: 1 · Первая запись: 2026-09-05 · Последнее наблюдение: 2026-09-05Кандидат на диагностическую перепроверку
-
наблюдалось UNKNOWN exit 1 ERR_ASSERTION Пробел в данных ×1 0.17.0 executionContext=node · moduleSystem=cjs · os=linux · runtime=node@22.23 sha256:88707d4d4ff1…node:internal/modules/run_main:<n> · triggerUncaughtException( · ^ · AssertionError [ERR_ASSERTION]: Got unwanted exception.node · unclassified-diagnostic · outer node · gap stage-unknownКачество данных: complete · Варианты среды: 1 · Первая запись: 2026-09-05 · Последнее наблюдение: 2026-09-05Кандидат на диагностическую перепроверку