Aufzeichnungennpmreact-dom19.2.8react-dom.hydrateRoot
Bedingungen ändern
Aktuelle Bedingungen
react-dom.hydrateRoot @19.2.8ubuntu glibc · x64 · node 22 · npm 10 · node
0 von 5 bestanden
Verifiziert — dieses Netzwerk hat an dieser Koordinate einen Contract ausgeführt.
hier gibt es ein Sample, und unser Lauf an dieser Koordinate ist fehlgeschlagen (2)
- Projektbeobachtungen
- 2 / 2
- Contract-Verifikationen
- 0 / 5
- Unabhängig meldende Peers
- 1
- Zuletzt erfasst
- 2026-08-30
Abhängigkeits-Zustand
Beobachtete Kombinationen und Fehlernachweise für dieses Release
Erster beobachteter Fehler
19.2.8
windows · node@24.13 · moduleSystem=esm · executionContext=node
31 FAIL
· stage: UNKNOWN
· fingerprint: sha256:9f91c975308128a0f4f23e33b9d5936b9c39535b5c01aa9245b8cdc4b0a37a10
| Bibliothek | Version | Zustand | Dort gemessen | Projekte |
|---|---|---|---|---|
| scheduler | 0.27.0 | CANDIDATE Korrelierte Änderung; unbewiesene Kombination | Contract bestanden | 10 Projekttage |
Die Messspalte betrifft das Release der jeweiligen Abhängigkeit selbst, nicht das Paar. Dass ein Resolver zwei Releases nebeneinandergestellt hat, ist kein Beleg dafür, dass sie zusammen funktionieren.
Abhängigkeitsversionen über Releases
Worauf jedes Release dieses Pakets seine Kinder aufgelöst hat. Ein Kind, dessen Version sich bewegt hat, steht zuerst: dort hat ein Upgrade etwas unter Ihnen verändert.
| Bibliothek | 19.3.0 | 19.2.8 | 19.0.0 | 18.3.1 | 18.2.0 |
|---|---|---|---|---|---|
| scheduler | 0.28.0 | 0.27.0 | 0.25.0 | 0.23.2 | 0.23.2 |
| loose-envify | — | — | — | 1.4.0 | 1.4.0 |
Bewegt: 1 · in jedem Release gleich: 1
Eine Kante hält fest, dass ein Resolver auf einer echten Maschine ein Release neben ein anderes gestellt hat. Sie behauptet nicht, dass beide zusammen funktionieren; diese Frage beantworten Samples und Contracts, nicht das Vorhandensein einer Zeile.
Aktuelle Fehler-Cluster
-
beobachtet PROJECT_PROCESS ERR_ASSERTION Beweislücke ×6 18.3.1 → 19.0.0 → 19.2.8 executionContext=nodeBeweisqualität: legacy-evidence-incomplete · Umgebungsvarianten: 3 · Zuerst erfasst: 2026-08-18 · Zuletzt gesehen: 2026-08-29Kandidat für diagnostische Neuprüfung
-
beobachtet UNKNOWN exit 1 Beweislücke ×2 19.2.8 executionContext=node · moduleSystem=esm · os=linux · runtime=node@22.23 react-dom.hydrateRoot sha256:529aac3b1da7…<url> · globalThis.navigator = dom.window.navigator; · ^ · TypeError: Cannot set property navigator of #<Object> which has only a getternode · unclassified-diagnostic · outer node · gap stage-unknownBeweisqualität: complete · Umgebungsvarianten: 1 · Zuerst erfasst: 2026-08-30 · Zuletzt gesehen: 2026-08-30Kandidat für diagnostische Neuprüfung
-
beobachtet UNKNOWN exit 1 ERR_ASSERTION Beweislücke ×1 19.2.8 executionContext=node · moduleSystem=esm · os=linux · runtime=node@22.23 react-dom.hydrateRoot sha256:1be69c158490…node:internal/modules/run_main:<n> · triggerUncaughtException( · ^ · AssertionError [ERR_ASSERTION]: Should record recoverable error on mismatchnode · unclassified-diagnostic · outer node · gap stage-unknownBeweisqualität: complete · Umgebungsvarianten: 1 · Zuerst erfasst: 2026-08-30 · Zuletzt gesehen: 2026-08-30Kandidat für diagnostische Neuprüfung
-
beobachtet UNKNOWN exit 1 Beweislücke ×1 19.2.8 executionContext=node · moduleSystem=esm · os=linux · runtime=node@22.23 react-dom.hydrateRoot sha256:679333e220d1…<path>:<n> · schedulerEvent = window.event; · ^ · ReferenceError: window is not definednode · unclassified-diagnostic · outer node · gap stage-unknownBeweisqualität: complete · Umgebungsvarianten: 1 · Zuerst erfasst: 2026-08-30 · Zuletzt gesehen: 2026-08-30Kandidat für diagnostische Neuprüfung
-
beobachtet UNKNOWN exit 1 Beweislücke ×1 19.2.8 executionContext=node · moduleSystem=esm · os=linux · runtime=node@22.23 react-dom.hydrateRoot sha256:f62c51c6f5ef…<url> · const { createElement as h, Component } = React; · ^^ · SyntaxError: Unexpected identifier <str>node · unclassified-diagnostic · outer node · gap stage-unknownBeweisqualität: complete · Umgebungsvarianten: 1 · Zuerst erfasst: 2026-08-30 · Zuletzt gesehen: 2026-08-30Kandidat für diagnostische Neuprüfung
-
beobachtet UNKNOWN exit 1 ERR_ASSERTION Beweislücke ×1 19.2.8 executionContext=node · moduleSystem=cjs · os=linux · runtime=node@22.23 sha256:1e505269791c…Contract test failed: AssertionError [ERR_ASSERTION]: identifierPrefix option should prefix generated IDs · at testPrerenderWithOptions (<path>:<n>:<n>) …node · unclassified-diagnostic · outer node · gap stage-unknownBeweisqualität: complete · Umgebungsvarianten: 1 · Zuerst erfasst: 2026-08-30 · Zuletzt gesehen: 2026-08-30Kandidat für diagnostische Neuprüfung
-
beobachtet UNKNOWN exit 1 ERR_ASSERTION Beweislücke ×1 19.2.8 executionContext=node · moduleSystem=cjs · os=linux · runtime=node@22.23 sha256:b79bb55ae46d…node:internal/modules/run_main:<n> · triggerUncaughtException( · ^ · AssertionError [ERR_ASSERTION]: Helper container should have 1 childnode · unclassified-diagnostic · outer node · gap stage-unknownBeweisqualität: complete · Umgebungsvarianten: 1 · Zuerst erfasst: 2026-08-30 · Zuletzt gesehen: 2026-08-30Kandidat für diagnostische Neuprüfung