Recordsnpmreact-dom19.2.8react-dom.default
Change the conditions
Current conditions
react-dom.default @19.2.8ubuntu glibc · x64 · node 22 · npm 10 · node
0 of 1 passed
Verified — this network ran a contract at this coordinate.
there is a sample here, and our run of it at this coordinate failed
- Project observations
- 2 / 2
- Contract verifications
- 0 / 1
- Independent reporting peers
- 1
- Last recorded
- 2026-08-30
Dependency Health
Observed combinations and failure evidence for this release
First observed break
19.2.8
windows · node@24.13 · moduleSystem=esm · executionContext=node
31 FAIL
· stage: UNKNOWN
· fingerprint: sha256:9f91c975308128a0f4f23e33b9d5936b9c39535b5c01aa9245b8cdc4b0a37a10
| Library | Version | Health | Measured there | Projects |
|---|---|---|---|---|
| scheduler | 0.27.0 | CANDIDATE Correlated change; unproven combination | contract passed | 10 project-days |
The measured column is about each dependency's own release, not about the pair. A resolver placing two releases side by side is not evidence that they work together.
Dependency versions across releases
What each release of this package resolved its children to. A child whose version moved is listed first: that is where an upgrade changed something underneath you.
| Library | 19.3.0 | 19.2.8 | 19.0.0 | 18.3.1 | 18.2.0 |
|---|---|---|---|---|---|
| scheduler | 0.28.0 | 0.27.0 | 0.25.0 | 0.23.2 | 0.23.2 |
| loose-envify | — | — | — | 1.4.0 | 1.4.0 |
Moved: 1 · unchanged at every release: 1
An edge records that a resolver placed one release beside another on a real machine. It is not a claim that the two work together; that question is answered by samples and contracts, not by presence here.
Recent failure clusters
-
observed PROJECT_PROCESS ERR_ASSERTION Evidence gap ×6 18.3.1 → 19.0.0 → 19.2.8 executionContext=nodeEvidence quality: legacy-evidence-incomplete · Environment variants: 3 · First recorded: 2026-08-18 · Last seen: 2026-08-29Diagnostic re-verification candidate
-
observed UNKNOWN exit 1 ERR_ASSERTION Evidence gap ×1 19.2.8 executionContext=node · moduleSystem=esm · os=linux · runtime=node@22.23 sha256:1be69c158490…node:internal/modules/run_main:<n> · triggerUncaughtException( · ^ · AssertionError [ERR_ASSERTION]: Should record recoverable error on mismatchnode · unclassified-diagnostic · outer node · gap stage-unknownEvidence quality: complete · Environment variants: 1 · First recorded: 2026-08-30 · Last seen: 2026-08-30Diagnostic re-verification candidate
-
observed UNKNOWN exit 1 Evidence gap ×1 19.2.8 executionContext=node · moduleSystem=esm · os=linux · runtime=node@22.23 sha256:529aac3b1da7…<url> · globalThis.navigator = dom.window.navigator; · ^ · TypeError: Cannot set property navigator of #<Object> which has only a getternode · unclassified-diagnostic · outer node · gap stage-unknownEvidence quality: complete · Environment variants: 1 · First recorded: 2026-08-30 · Last seen: 2026-08-30Diagnostic re-verification candidate
-
observed UNKNOWN exit 1 Evidence gap ×1 19.2.8 executionContext=node · moduleSystem=esm · os=linux · runtime=node@22.23 react-dom.default sha256:679333e220d1…<path>:<n> · schedulerEvent = window.event; · ^ · ReferenceError: window is not definednode · unclassified-diagnostic · outer node · gap stage-unknownEvidence quality: complete · Environment variants: 1 · First recorded: 2026-08-30 · Last seen: 2026-08-30Diagnostic re-verification candidate
-
observed UNKNOWN exit 1 Evidence gap ×1 19.2.8 executionContext=node · moduleSystem=esm · os=linux · runtime=node@22.23 sha256:f62c51c6f5ef…<url> · const { createElement as h, Component } = React; · ^^ · SyntaxError: Unexpected identifier <str>node · unclassified-diagnostic · outer node · gap stage-unknownEvidence quality: complete · Environment variants: 1 · First recorded: 2026-08-30 · Last seen: 2026-08-30Diagnostic re-verification candidate
-
observed UNKNOWN exit 1 ERR_ASSERTION Evidence gap ×1 19.2.8 executionContext=node · moduleSystem=cjs · os=linux · runtime=node@22.23 sha256:1e505269791c…Contract test failed: AssertionError [ERR_ASSERTION]: identifierPrefix option should prefix generated IDs · at testPrerenderWithOptions (<path>:<n>:<n>) …node · unclassified-diagnostic · outer node · gap stage-unknownEvidence quality: complete · Environment variants: 1 · First recorded: 2026-08-30 · Last seen: 2026-08-30Diagnostic re-verification candidate
-
observed UNKNOWN exit 1 ERR_ASSERTION Evidence gap ×1 19.2.8 executionContext=node · moduleSystem=cjs · os=linux · runtime=node@22.23 sha256:b79bb55ae46d…node:internal/modules/run_main:<n> · triggerUncaughtException( · ^ · AssertionError [ERR_ASSERTION]: Helper container should have 1 childnode · unclassified-diagnostic · outer node · gap stage-unknownEvidence quality: complete · Environment variants: 1 · First recorded: 2026-08-30 · Last seen: 2026-08-30Diagnostic re-verification candidate