Registrosnpmpostcss8.5.26postcss.Container
Mudar as condições
Condições atuais
postcss.Container @8.5.26ubuntu glibc · x64 · node 22 · npm 10 · node
1 de 1 passaram
Observado — builds reais de projetos reportaram desta coordenada.
ainda sem amostra nesta coordenada
- Observações de projetos
- 1 / 1
- Verificações de contrato
- nada nesta coordenada
- Peers independentes que reportaram
- 1
- Último registro
- 2026-08-31
Saúde das dependências
Combinações observadas e evidências de falha para esta versão
Primeira quebra observada
8.5.26
executionContext=node
42 FAIL
· stage: PROCESS_START
· fingerprint: sha256:c12549970456efb5abdc90b679695c6689107d4f097d612245d6bfb25e01ec32
| Biblioteca | Versão | Saúde | Medido ali | Projetos |
|---|---|---|---|---|
| nanoid | 3.3.18 | CANDIDATE Mudança correlacionada; combinação não comprovada | contrato aprovado | 37 dias-projeto |
| picocolors | 1.1.1 | PASS Todas as observações passaram | contrato aprovado | 37 dias-projeto |
| source-map-js | 1.2.1 | PASS Todas as observações passaram | contrato aprovado | 37 dias-projeto |
A coluna de medição é sobre a versão de cada dependência em si, não sobre o par. Um resolvedor ter colocado duas versões lado a lado não é prova de que funcionam juntas.
Versões de dependências por versão
Para que cada versão deste pacote resolveu seus filhos. O filho cuja versão se moveu vem primeiro: foi ali que uma atualização mudou algo sob os seus pés.
| Biblioteca | 8.5.28 | 8.5.26 | 8.5.25 | 8.5.6 | 8.5.2 | 8.4.49 | 8.4.31 |
|---|---|---|---|---|---|---|---|
| nanoid | 3.3.19 | 3.3.18 | 3.3.18 | 3.3.18 | 3.3.18 | 3.3.18 | 3.3.11 |
| picocolors | 1.1.1 | 1.1.1 | 1.1.1 | 1.1.1 | 1.1.1 | 1.1.1 | 1.1.1 |
| source-map-js | 1.2.1 | 1.2.1 | 1.2.1 | 1.2.1 | 1.2.1 | 1.2.1 | 1.2.1 |
| tailwindcss | — | — | — | — | — | 3.4.17 | — |
Moveram-se: 1 · iguais em todas as versões: 3
Uma aresta registra que um resolvedor colocou uma versão ao lado de outra em uma máquina real. Não é uma afirmação de que as duas funcionam juntas; essa pergunta é respondida por amostras e contratos, não pela presença de uma linha.
Clusters de falha recentes
-
observado PROCESS_START process start failed Lacuna de evidência ×42 8.5.26 → 8.5.28 executionContext=node sha256:c12549970456…· structured-termination · gap diagnostic-missingQualidade da evidência: partial · Variantes de ambiente: 4 · Primeiro registro: 2026-08-31 · Visto por último: 2026-09-16Candidato a reverificação diagnóstica
-
observado UNKNOWN exit 1 ERR_ASSERTION Lacuna de evidência ×11 8.5.26 → 8.5.28 executionContext=node · os=linux · runtime=node@22.23 sha256:986d98189e70…node:internal/modules/run_main:<n> · triggerUncaughtException( · ^ · AssertionError [ERR_ASSERTION]: Expected values to be strictly equal:node · unclassified-diagnostic · outer node · gap stage-unknownQualidade da evidência: complete · Variantes de ambiente: 2 · Primeiro registro: 2026-08-30 · Visto por último: 2026-09-05Candidato a reverificação diagnóstica
-
observado PROJECT_PROCESS ERR_ASSERTION Lacuna de evidência ×6 8.5.26 executionContext=node · moduleSystem=esmQualidade da evidência: legacy-evidence-incomplete · Variantes de ambiente: 2 · Primeiro registro: 2026-08-14 · Visto por último: 2026-08-30Candidato a reverificação diagnóstica
-
observado UNKNOWN exit 1 ERR_MODULE_NOT_FOUND Lacuna de evidência ×5 8.5.26 → 8.5.28 executionContext=node · moduleSystem=cjs · os=linux · runtime=node@22.23 sha256:88af852f99a8…node:internal/modules/package_json_reader:<n> · throw new ERR_MODULE_NOT_FOUND(packageName, fileURLToPath(base), null); · ^ …node · unclassified-diagnostic · outer node · gap stage-unknownQualidade da evidência: complete · Variantes de ambiente: 1 · Primeiro registro: 2026-08-30 · Visto por último: 2026-09-14Candidato a reverificação diagnóstica
-
observado UNKNOWN exit 1 Lacuna de evidência ×3 8.5.26 → 8.5.28 executionContext=node · moduleSystem=esm · os=linux · runtime=node@22.23 sha256:8fd30f2a6304…fil<path>:<n> · throw new Error(errorMsg); · ^ · Error: Vitest failed to access its internal state.node · unclassified-diagnostic · outer node · gap stage-unknownQualidade da evidência: complete · Variantes de ambiente: 1 · Primeiro registro: 2026-08-31 · Visto por último: 2026-09-08Candidato a reverificação diagnóstica
-
observado UNKNOWN exit 1 Lacuna de evidência ×2 8.5.26 executionContext=node · moduleSystem=esm · os=linux · runtime=node@22.23 sha256:cc724e2e6a32…<path>:<n> · module.exports = require.addon() · ^ · TypeError: require.addon is not a functionnode · unclassified-diagnostic · outer node · gap stage-unknownQualidade da evidência: complete · Variantes de ambiente: 1 · Primeiro registro: 2026-08-31 · Visto por último: 2026-08-31Candidato a reverificação diagnóstica
-
observado UNKNOWN exit 1 Lacuna de evidência ×2 8.5.26 → 8.5.28 executionContext=node · moduleSystem=cjs · os=linux · runtime=node@22.23 sha256:91ad26545eb1…node:internal/modules/cjs/loader:<n> · throw err; · ^ · Error: Cannot find module <str>node · unclassified-diagnostic · outer node · gap stage-unknownQualidade da evidência: complete · Variantes de ambiente: 1 · Primeiro registro: 2026-08-31 · Visto por último: 2026-09-07Candidato a reverificação diagnóstica
-
observado UNKNOWN exit 1 ERR_ASSERTION Lacuna de evidência ×1 8.5.26 executionContext=node · moduleSystem=esm · os=linux · runtime=node@22.23 sha256:10e769edac62…node:internal/modules/run_main:<n> · triggerUncaughtException( · ^ · AssertionError [ERR_ASSERTION]: The expression evaluated to a falsy value:node · unclassified-diagnostic · outer node · gap stage-unknownQualidade da evidência: complete · Variantes de ambiente: 1 · Primeiro registro: 2026-08-30 · Visto por último: 2026-08-30Candidato a reverificação diagnóstica
-
observado UNKNOWN exit 1 ERR_ASSERTION Lacuna de evidência ×1 8.5.26 executionContext=node · moduleSystem=cjs · os=linux · runtime=node@22.23 sha256:7e183c71f747…node:internal/modules/run_main:<n> · triggerUncaughtException( · ^ · AssertionError [ERR_ASSERTION]: stringified output must reflect rawsnode · unclassified-diagnostic · outer node · gap stage-unknownQualidade da evidência: complete · Variantes de ambiente: 1 · Primeiro registro: 2026-08-31 · Visto por último: 2026-08-31Candidato a reverificação diagnóstica
-
observado UNKNOWN exit 134 Lacuna de evidência ×1 8.5.26 executionContext=node · moduleSystem=esm · os=linux · runtime=node@22.23 sha256:d3bdb145402a…Uncaught ReferenceError: require is not defined · at <url> · at Module._run (bar<path>:<n>:<n>) · at Module._evaluate (bar<path>:<n>:<n>)node · unclassified-diagnostic · outer node · gap stage-unknownQualidade da evidência: complete · Variantes de ambiente: 1 · Primeiro registro: 2026-08-31 · Visto por último: 2026-08-31Candidato a reverificação diagnóstica
-
observado UNKNOWN exit 1 Lacuna de evidência ×1 8.5.26 executionContext=node · moduleSystem=esm · os=linux · runtime=node@22.23 sha256:fe5d7d9a3fb6…<path>:<n> · if (i.parent) i.parent.removeChild(i) · ^ · TypeError: Cannot read properties of undefined (reading <str>)node · unclassified-diagnostic · outer node · gap stage-unknownQualidade da evidência: complete · Variantes de ambiente: 1 · Primeiro registro: 2026-08-31 · Visto por último: 2026-08-31Candidato a reverificação diagnóstica
-
observado UNKNOWN exit 1 Lacuna de evidência ×1 8.5.26 executionContext=node · moduleSystem=esm · os=linux · runtime=node@22.23 sha256:9be950af9140…Traceback (most recent call last): · File <str>, line 1, in <module> · ModuleNotFoundError: No module named <str>python3 · unclassified-diagnostic · outer python3 · gap stage-unknownQualidade da evidência: complete · Variantes de ambiente: 1 · Primeiro registro: 2026-08-31 · Visto por último: 2026-08-31Candidato a reverificação diagnóstica
Mostrando os 12 mais relatados de 23 grupos de falhas registrados. O resto são relatos únicos.