记录npmpathe2.0.3pathe.format
更改条件
依赖健康度
某次解析读取了该版本的依赖树,没有发现依赖。这是一次测量结果,而不是缺失。
近期失败聚类
-
已观测 PROCESS_START process start failed 证据缺口 ×40 1.1.2 → 2.0.3 executionContext=node sha256:c12549970456…· structured-termination · gap diagnostic-missing证据质量: partial · 环境变体: 3 · 首次记录: 2026-08-31 · 最近观测: 2026-09-16诊断复验候选
-
已观测 UNKNOWN exit 1 ERR_ASSERTION 证据缺口 ×11 1.1.2 → 2.0.3 executionContext=node · os=linux · runtime=node@22.23 sha256:986d98189e70…node:internal/modules/run_main:<n> · triggerUncaughtException( · ^ · AssertionError [ERR_ASSERTION]: Expected values to be strictly equal:node · unclassified-diagnostic · outer node · gap stage-unknown证据质量: complete · 环境变体: 2 · 首次记录: 2026-08-30 · 最近观测: 2026-09-06诊断复验候选
-
已观测 PROJECT_PROCESS ERR_ASSERTION 证据缺口 ×8 2.0.3 executionContext=node证据质量: legacy-evidence-incomplete · 环境变体: 3 · 首次记录: 2026-08-14 · 最近观测: 2026-08-30诊断复验候选
-
已观测 UNKNOWN exit 1 证据缺口 ×3 1.1.2 → 2.0.3 executionContext=node · moduleSystem=cjs · os=linux · runtime=node@22.23 sha256:91ad26545eb1…node:internal/modules/cjs/loader:<n> · throw err; · ^ · Error: Cannot find module <str>node · unclassified-diagnostic · outer node · gap stage-unknown证据质量: complete · 环境变体: 1 · 首次记录: 2026-08-30 · 最近观测: 2026-09-07诊断复验候选
-
已观测 UNKNOWN exit 1 ERR_MODULE_NOT_FOUND 证据缺口 ×3 2.0.3 executionContext=node · moduleSystem=cjs · os=linux · runtime=node@22.23 sha256:88af852f99a8…node:internal/modules/package_json_reader:<n> · throw new ERR_MODULE_NOT_FOUND(packageName, fileURLToPath(base), null); · ^ …node · unclassified-diagnostic · outer node · gap stage-unknown证据质量: complete · 环境变体: 1 · 首次记录: 2026-08-31 · 最近观测: 2026-09-14诊断复验候选
-
已观测 UNKNOWN exit 1 证据缺口 ×3 1.1.2 → 2.0.3 executionContext=node · moduleSystem=esm · os=linux · runtime=node@22.23 sha256:8fd30f2a6304…fil<path>:<n> · throw new Error(errorMsg); · ^ · Error: Vitest failed to access its internal state.node · unclassified-diagnostic · outer node · gap stage-unknown证据质量: complete · 环境变体: 1 · 首次记录: 2026-08-31 · 最近观测: 2026-09-08诊断复验候选
-
已观测 UNKNOWN exit 1 ERR_ASSERTION 证据缺口 ×2 2.0.3 executionContext=node · moduleSystem=cjs · os=linux · runtime=node@22.23 sha256:0ab3a7004d66…node:assert:<n> · throw new AssertionError(obj); · ^ · AssertionError [ERR_ASSERTION]: Expected values to be strictly equal:node · unclassified-diagnostic · outer node · gap stage-unknown证据质量: complete · 环境变体: 1 · 首次记录: 2026-08-29 · 最近观测: 2026-08-29诊断复验候选
-
已观测 UNKNOWN exit 1 证据缺口 ×2 2.0.3 executionContext=node · moduleSystem=cjs · os=linux · runtime=node@22.23 pathe.format sha256:8310a83be884…node:internal/modules/cjs/loader:<n> · const err = new Error(message); · ^ · Error: Cannot find module <str>node · unclassified-diagnostic · outer node · gap stage-unknown证据质量: complete · 环境变体: 1 · 首次记录: 2026-08-30 · 最近观测: 2026-09-04诊断复验候选
-
已观测 PROJECT_TEST exit 1 ERR_LOAD_URL ×1 2.0.3 executionContext=node · moduleSystem=esm · os=linux · runtime=node@22.23 sha256:a60e7101af87…Contract test failed: Error: Failed to load custom Reporter from basic · at loadCustomReporterModule (fil<path>:<n>:<n>) · at fil<path>:<n>:<n> …javascript/test-runner · test-runner-diagnostic · outer npm test证据质量: complete · 环境变体: 1 · 首次记录: 2026-08-31 · 最近观测: 2026-08-31
-
已观测 UNKNOWN exit 1 证据缺口 ×1 2.0.3 executionContext=node · moduleSystem=cjs · os=linux · runtime=node@22.23 sha256:b0eaa0205718…FAIL: dirname(<str>) => <str>, expected <str>node · unclassified-diagnostic · outer node · gap stage-unknown证据质量: complete · 环境变体: 1 · 首次记录: 2026-09-04 · 最近观测: 2026-09-04诊断复验候选
-
已观测 UNKNOWN exit 1 证据缺口 ×1 2.0.3 executionContext=node · moduleSystem=esm · os=linux · runtime=node@22.23 sha256:57bd6b054872…fil<path>:<n> · file.shuffle = config.sequence.shuffle; · ^ · TypeError: Cannot read properties of undefined (reading <str>)node · unclassified-diagnostic · outer node · gap stage-unknown证据质量: complete · 环境变体: 1 · 首次记录: 2026-09-06 · 最近观测: 2026-09-06诊断复验候选
-
已观测 UNKNOWN exit 1 ERR_ASSERTION 证据缺口 ×1 2.0.3 executionContext=node · moduleSystem=esm · os=linux · runtime=node@22.23 sha256:43caf7a060e7…node:internal/modules/run_main:<n> · triggerUncaughtException( · ^ · AssertionError [ERR_ASSERTION]: Expected values to be strictly deep-equal:node · unclassified-diagnostic · outer node · gap stage-unknown证据质量: complete · 环境变体: 1 · 首次记录: 2026-09-06 · 最近观测: 2026-09-06诊断复验候选
显示报告最多的 12 个。此坐标记录的失败聚类共 17 个。其余为单次报告。