記録npmobug2.1.4obug.enabled
条件を変更
依存関係のヘルス
ある解決処理がこのリリースのツリーを読み、依存関係はありませんでした。欠落ではなく測定結果です。
最近の失敗クラスター
-
観測済み UNKNOWN exit 1 証拠の欠落 ×2 2.1.4 executionContext=node · moduleSystem=esm · os=linux · runtime=node@22.23 sha256:455451e1a14e…<url>]:<n> · import babel from <str>; · ^^^^^ · SyntaxError: The requested module <str> does not provide an export named <str>node · unclassified-diagnostic · outer node · gap stage-unknown証拠品質: complete · 環境バリアント: 1 · 初回記録: 2026-09-02 · 最終観測: 2026-09-05診断再検証候補
-
観測済み UNKNOWN exit 1 ERR_ASSERTION 証拠の欠落 ×1 2.1.4 executionContext=node · moduleSystem=cjs · os=linux · runtime=node@22.23 sha256:986d98189e70…node:internal/modules/run_main:<n> · triggerUncaughtException( · ^ · AssertionError [ERR_ASSERTION]: Expected values to be strictly equal:node · unclassified-diagnostic · outer node · gap stage-unknown証拠品質: complete · 環境バリアント: 1 · 初回記録: 2026-08-31 · 最終観測: 2026-08-31診断再検証候補
-
観測済み UNKNOWN exit 1 ERR_ASSERTION 証拠の欠落 ×1 2.1.4 executionContext=node · moduleSystem=esm · os=linux · runtime=node@22.23 sha256:c713e7987e7b…node:internal/modules/run_main:<n> · triggerUncaughtException( · ^ · AssertionError [ERR_ASSERTION]: Inner visitor must handle ForOfStatementnode · unclassified-diagnostic · outer node · gap stage-unknown証拠品質: complete · 環境バリアント: 1 · 初回記録: 2026-08-31 · 最終観測: 2026-08-31診断再検証候補
-
観測済み PROJECT_TEST exit 1 ERR_LOAD_URL ×1 2.1.4 executionContext=node · moduleSystem=esm · os=linux · runtime=node@22.23 sha256:a60e7101af87…Contract test failed: Error: Failed to load custom Reporter from basic · at loadCustomReporterModule (fil<path>:<n>:<n>) · at fil<path>:<n>:<n> …javascript/test-runner · test-runner-diagnostic · outer npm test証拠品質: complete · 環境バリアント: 1 · 初回記録: 2026-08-31 · 最終観測: 2026-08-31
-
観測済み UNKNOWN exit 1 ERR_ASSERTION 証拠の欠落 ×1 2.1.4 executionContext=node · moduleSystem=esm · os=linux · runtime=node@22.23 obug.enabled sha256:3ebde25596ce…Contract test failed: AssertionError [ERR_ASSERTION]: Logged message must format arguments correctly · at main (<url>) · at <url> …node · unclassified-diagnostic · outer node · gap stage-unknown証拠品質: complete · 環境バリアント: 1 · 初回記録: 2026-08-31 · 最終観測: 2026-08-31診断再検証候補
-
観測済み UNKNOWN exit 1 証拠の欠落 ×1 2.1.4 executionContext=node · moduleSystem=esm · os=linux · runtime=node@22.23 sha256:fb30df1477f2…<url> · assert.strictEqual(output.includes(<str>2.0.0<str>), true); · ^^^^^^^^^^^^^^^^^^^^^^^^^^^^^^^^^^^^^^^^ · SyntaxError: missing ) after argument listnode · unclassified-diagnostic · outer node · gap stage-unknown証拠品質: complete · 環境バリアント: 1 · 初回記録: 2026-09-02 · 最終観測: 2026-09-02診断再検証候補
-
観測済み UNKNOWN exit 1 証拠の欠落 ×1 2.1.4 executionContext=node · moduleSystem=esm · os=linux · runtime=node@22.23 sha256:ff4ca6a168fb…fil<path>:<n> · const error = new SyntaxError(); · ^ · SyntaxError: unknown: <str> outside of function. (10:<n>)node · unclassified-diagnostic · outer node · gap stage-unknown証拠品質: complete · 環境バリアント: 1 · 初回記録: 2026-09-02 · 最終観測: 2026-09-02診断再検証候補
-
観測済み UNKNOWN exit 1 ERR_ASSERTION 証拠の欠落 ×1 2.1.4 executionContext=node · moduleSystem=esm · os=linux · runtime=node@22.23 sha256:963dc79aa288…node:internal/modules/run_main:<n> · triggerUncaughtException( · ^ · AssertionError [ERR_ASSERTION]: Arrow function must be converted to function expressionnode · unclassified-diagnostic · outer node · gap stage-unknown証拠品質: complete · 環境バリアント: 1 · 初回記録: 2026-09-03 · 最終観測: 2026-09-03診断再検証候補
-
観測済み PROCESS_START process start failed 証拠の欠落 ×1 2.1.4 executionContext=node · moduleSystem=cjs · os=linux · runtime=node@22.23 sha256:c12549970456…· structured-termination · gap diagnostic-missing証拠品質: partial · 環境バリアント: 1 · 初回記録: 2026-09-05 · 最終観測: 2026-09-05診断再検証候補
-
観測済み PROJECT_RESOLVE exit 1 ×1 2.1.4 executionContext=node · moduleSystem=cjs · os=linux · runtime=node@22.23 sha256:15e1b71df43a…test_contract.go:<n>:<n>: no required module provides package golang.org/x/text/unicode/norm: go.mod file not found in current directory or any parent …go/module · resolve-diagnostic · outer go run証拠品質: complete · 環境バリアント: 1 · 初回記録: 2026-09-05 · 最終観測: 2026-09-05
-
観測済み UNKNOWN exit 1 証拠の欠落 ×1 2.1.4 executionContext=node · moduleSystem=esm · os=linux · runtime=node@22.23 sha256:036052acb454…[eval]:<n> · const inst1 = plugin(api, { method: <str>, include: [<str>, <str>] }); · ^ · TypeError: plugin is not a functionnode · unclassified-diagnostic · outer node · gap stage-unknown証拠品質: complete · 環境バリアント: 1 · 初回記録: 2026-09-05 · 最終観測: 2026-09-05診断再検証候補
-
観測済み UNKNOWN exit 1 証拠の欠落 ×1 2.1.4 executionContext=node · moduleSystem=cjs · os=linux · runtime=node@22.23 sha256:138a106a5937…stat main.go: no such file or directorygo · unclassified-diagnostic · outer go run · gap stage-unknown証拠品質: complete · 環境バリアント: 1 · 初回記録: 2026-09-05 · 最終観測: 2026-09-05診断再検証候補
最も多く報告された 12 件を表示しています。この座標に記録された失敗クラスタは 18 件です。残りは単発の報告です。