기록npmobject-keys1.1.1object-keys.shim
조건 변경
현재 조건
object-keys.shim @1.1.1ubuntu glibc · x64 · node 22 · npm 10 · node
24회 중 0회 통과
검증 — 이 네트워크가 이 좌표에서 컨트랙트를 직접 실행했습니다.
샘플 있음 — 이 좌표에서 우리가 실행했고 실패함 (1)
- 프로젝트 관측
- 22 / 22
- 컨트랙트 검증
- 0 / 24
- 독립 보고 peer
- 3
- 마지막 기록
- 2026-08-31
열어 볼 수 있는 증거
의존성 건강도
어떤 해결 과정이 이 릴리스의 트리를 읽었고 의존성이 없었습니다. 빠진 것이 아니라 측정된 것입니다.
최근 실패 클러스터
-
관측됨 UNKNOWN exit 1 증거 공백 ×16 1.1.1 executionContext=node · moduleSystem=cjs · os=linux · runtime=node@22.23 object-keys.shim sha256:9be950af9140…Traceback (most recent call last): · File <str>, line 1, in <module> · ModuleNotFoundError: No module named <str>python3 · unclassified-diagnostic · outer python3 · gap stage-unknown증거 품질: complete · 환경 변형: 1 · 최초 관측: 2026-08-30 · 마지막 관측: 2026-08-31진단 재검증 후보
-
관측됨 UNKNOWN exit 1 증거 공백 ×8 1.1.1 executionContext=node · moduleSystem=cjs · os=linux · runtime=node@22.23 object-keys.shim sha256:91ad26545eb1…node:internal/modules/cjs/loader:<n> · throw err; · ^ · Error: Cannot find module <str>node · unclassified-diagnostic · outer node · gap stage-unknown증거 품질: complete · 환경 변형: 1 · 최초 관측: 2026-08-31 · 마지막 관측: 2026-08-31진단 재검증 후보
-
관측됨 PROCESS_START process start failed 증거 공백 ×7 1.1.1 executionContext=node sha256:c12549970456…· structured-termination · gap diagnostic-missing증거 품질: partial · 환경 변형: 2 · 최초 관측: 2026-08-30 · 마지막 관측: 2026-09-16진단 재검증 후보
-
관측됨 PROJECT_PROCESS 증거 공백 ×4 1.1.1 executionContext=node · moduleSystem=cjs · os=linux · runtime=node@22.23증거 품질: legacy-evidence-incomplete · 환경 변형: 1 · 최초 관측: 2026-08-27 · 마지막 관측: 2026-08-27진단 재검증 후보
-
관측됨 UNKNOWN exit 1 ERR_MODULE_NOT_FOUND 증거 공백 ×4 1.1.1 executionContext=node · moduleSystem=cjs · os=linux · runtime=node@22.23 object-keys.shim sha256:88af852f99a8…node:internal/modules/package_json_reader:<n> · throw new ERR_MODULE_NOT_FOUND(packageName, fileURLToPath(base), null); · ^ …node · unclassified-diagnostic · outer node · gap stage-unknown증거 품질: complete · 환경 변형: 1 · 최초 관측: 2026-08-29 · 마지막 관측: 2026-08-31진단 재검증 후보
-
관측됨 UNKNOWN exit 2 증거 공백 ×4 1.1.1 executionContext=node · moduleSystem=cjs · os=linux · runtime=node@22.23 sha256:fddf8ea09045…Using CPython 3.12.3 interpreter at: <path> · Creating virtual environment at: .venv · error: Failed to create virtual environment …· unclassified-diagnostic · gap stage-unknown증거 품질: complete · 환경 변형: 1 · 최초 관측: 2026-08-30 · 마지막 관측: 2026-08-31진단 재검증 후보
-
관측됨 UNKNOWN exit 1 증거 공백 ×4 1.1.1 executionContext=node · moduleSystem=cjs · os=linux · runtime=node@22.23 sha256:72ba2d1e946f…<path>: No module named pippython3 · unclassified-diagnostic · outer python3 · gap stage-unknown증거 품질: complete · 환경 변형: 1 · 최초 관측: 2026-08-31 · 마지막 관측: 2026-08-31진단 재검증 후보
-
관측됨 UNKNOWN exit 1 증거 공백 ×2 1.1.1 executionContext=node · moduleSystem=cjs · os=linux · runtime=node@22.23 object-keys.shim sha256:8310a83be884…node:internal/modules/cjs/loader:<n> · const err = new Error(message); · ^ · Error: Cannot find module <str>node · unclassified-diagnostic · outer node · gap stage-unknown증거 품질: complete · 환경 변형: 1 · 최초 관측: 2026-08-29 · 마지막 관측: 2026-08-29진단 재검증 후보
-
관측됨 UNKNOWN exit 1 증거 공백 ×2 1.1.1 executionContext=node · moduleSystem=cjs · os=linux · runtime=node@22.23 object-keys.shim sha256:9922ca80f240…go: <path> already existsgo · unclassified-diagnostic · outer go mod · gap stage-unknown증거 품질: complete · 환경 변형: 1 · 최초 관측: 2026-08-29 · 마지막 관측: 2026-08-29진단 재검증 후보
-
관측됨 UNKNOWN exit 1 ERR_ASSERTION 증거 공백 ×2 1.1.1 executionContext=node · moduleSystem=cjs · os=linux · runtime=node@22.23 object-keys.shim sha256:07e974cf28d4…Test failed: AssertionError [ERR_ASSERTION]: getFeedURL should return configured feed url · + actual - expected · + <str> · - <str>node · unclassified-diagnostic · outer node · gap stage-unknown증거 품질: complete · 환경 변형: 1 · 최초 관측: 2026-08-31 · 마지막 관측: 2026-08-31진단 재검증 후보
-
관측됨 UNKNOWN exit 1 증거 공백 ×2 1.1.1 executionContext=node · moduleSystem=cjs · os=linux · runtime=node@22.23 object-keys.shim sha256:1c03ca490615…Traceback (most recent call last): · File <str>, line 3, in <module> · AttributeError: module <str> has no attribute <str> · IANA_VERSION: <str>python · unclassified-diagnostic · outer python · gap stage-unknown증거 품질: complete · 환경 변형: 1 · 최초 관측: 2026-08-31 · 마지막 관측: 2026-08-31진단 재검증 후보
-
관측됨 UNKNOWN exit 1 증거 공백 ×2 1.1.1 executionContext=node · moduleSystem=cjs · os=linux · runtime=node@22.23 object-keys.shim sha256:d296ed2b3573…Traceback (most recent call last): · File <str>, line 5, in <module> · ModuleNotFoundError: No module named <str> · IANA_VERSION: <str>python · unclassified-diagnostic · outer python · gap stage-unknown증거 품질: complete · 환경 변형: 1 · 최초 관측: 2026-08-31 · 마지막 관측: 2026-08-31진단 재검증 후보
가장 많이 보고된 12개를 보여줍니다. 이 좌표에 기록된 실패 클러스터는 38개입니다. 나머지는 단발 보고입니다.