記録npmobject-keys1.1.1object-keys.shim
条件を変更
現在の条件
object-keys.shim @1.1.1ubuntu glibc · x64 · node 22 · npm 10 · node
24 回中 0 回が成功
検証 — このネットワークがこの座標でコントラクトを実行しました。
サンプルあり — この座標で実行し、失敗した (1)
- プロジェクト観測
- 22 / 22
- コントラクト検証
- 0 / 24
- 独立した報告ピア
- 3
- 最終記録
- 2026-08-31
開ける証拠
依存関係のヘルス
ある解決処理がこのリリースのツリーを読み、依存関係はありませんでした。欠落ではなく測定結果です。
最近の失敗クラスター
-
観測済み UNKNOWN exit 1 証拠の欠落 ×16 1.1.1 executionContext=node · moduleSystem=cjs · os=linux · runtime=node@22.23 object-keys.shim sha256:9be950af9140…Traceback (most recent call last): · File <str>, line 1, in <module> · ModuleNotFoundError: No module named <str>python3 · unclassified-diagnostic · outer python3 · gap stage-unknown証拠品質: complete · 環境バリアント: 1 · 初回記録: 2026-08-30 · 最終観測: 2026-08-31診断再検証候補
-
観測済み UNKNOWN exit 1 証拠の欠落 ×8 1.1.1 executionContext=node · moduleSystem=cjs · os=linux · runtime=node@22.23 object-keys.shim sha256:91ad26545eb1…node:internal/modules/cjs/loader:<n> · throw err; · ^ · Error: Cannot find module <str>node · unclassified-diagnostic · outer node · gap stage-unknown証拠品質: complete · 環境バリアント: 1 · 初回記録: 2026-08-31 · 最終観測: 2026-08-31診断再検証候補
-
観測済み PROCESS_START process start failed 証拠の欠落 ×7 1.1.1 executionContext=node sha256:c12549970456…· structured-termination · gap diagnostic-missing証拠品質: partial · 環境バリアント: 2 · 初回記録: 2026-08-30 · 最終観測: 2026-09-16診断再検証候補
-
観測済み PROJECT_PROCESS 証拠の欠落 ×4 1.1.1 executionContext=node · moduleSystem=cjs · os=linux · runtime=node@22.23証拠品質: legacy-evidence-incomplete · 環境バリアント: 1 · 初回記録: 2026-08-27 · 最終観測: 2026-08-27診断再検証候補
-
観測済み UNKNOWN exit 1 ERR_MODULE_NOT_FOUND 証拠の欠落 ×4 1.1.1 executionContext=node · moduleSystem=cjs · os=linux · runtime=node@22.23 object-keys.shim sha256:88af852f99a8…node:internal/modules/package_json_reader:<n> · throw new ERR_MODULE_NOT_FOUND(packageName, fileURLToPath(base), null); · ^ …node · unclassified-diagnostic · outer node · gap stage-unknown証拠品質: complete · 環境バリアント: 1 · 初回記録: 2026-08-29 · 最終観測: 2026-08-31診断再検証候補
-
観測済み UNKNOWN exit 2 証拠の欠落 ×4 1.1.1 executionContext=node · moduleSystem=cjs · os=linux · runtime=node@22.23 sha256:fddf8ea09045…Using CPython 3.12.3 interpreter at: <path> · Creating virtual environment at: .venv · error: Failed to create virtual environment …· unclassified-diagnostic · gap stage-unknown証拠品質: complete · 環境バリアント: 1 · 初回記録: 2026-08-30 · 最終観測: 2026-08-31診断再検証候補
-
観測済み UNKNOWN exit 1 証拠の欠落 ×4 1.1.1 executionContext=node · moduleSystem=cjs · os=linux · runtime=node@22.23 sha256:72ba2d1e946f…<path>: No module named pippython3 · unclassified-diagnostic · outer python3 · gap stage-unknown証拠品質: complete · 環境バリアント: 1 · 初回記録: 2026-08-31 · 最終観測: 2026-08-31診断再検証候補
-
観測済み UNKNOWN exit 1 証拠の欠落 ×2 1.1.1 executionContext=node · moduleSystem=cjs · os=linux · runtime=node@22.23 object-keys.shim sha256:8310a83be884…node:internal/modules/cjs/loader:<n> · const err = new Error(message); · ^ · Error: Cannot find module <str>node · unclassified-diagnostic · outer node · gap stage-unknown証拠品質: complete · 環境バリアント: 1 · 初回記録: 2026-08-29 · 最終観測: 2026-08-29診断再検証候補
-
観測済み UNKNOWN exit 1 証拠の欠落 ×2 1.1.1 executionContext=node · moduleSystem=cjs · os=linux · runtime=node@22.23 object-keys.shim sha256:9922ca80f240…go: <path> already existsgo · unclassified-diagnostic · outer go mod · gap stage-unknown証拠品質: complete · 環境バリアント: 1 · 初回記録: 2026-08-29 · 最終観測: 2026-08-29診断再検証候補
-
観測済み UNKNOWN exit 1 ERR_ASSERTION 証拠の欠落 ×2 1.1.1 executionContext=node · moduleSystem=cjs · os=linux · runtime=node@22.23 object-keys.shim sha256:07e974cf28d4…Test failed: AssertionError [ERR_ASSERTION]: getFeedURL should return configured feed url · + actual - expected · + <str> · - <str>node · unclassified-diagnostic · outer node · gap stage-unknown証拠品質: complete · 環境バリアント: 1 · 初回記録: 2026-08-31 · 最終観測: 2026-08-31診断再検証候補
-
観測済み UNKNOWN exit 1 証拠の欠落 ×2 1.1.1 executionContext=node · moduleSystem=cjs · os=linux · runtime=node@22.23 object-keys.shim sha256:1c03ca490615…Traceback (most recent call last): · File <str>, line 3, in <module> · AttributeError: module <str> has no attribute <str> · IANA_VERSION: <str>python · unclassified-diagnostic · outer python · gap stage-unknown証拠品質: complete · 環境バリアント: 1 · 初回記録: 2026-08-31 · 最終観測: 2026-08-31診断再検証候補
-
観測済み UNKNOWN exit 1 証拠の欠落 ×2 1.1.1 executionContext=node · moduleSystem=cjs · os=linux · runtime=node@22.23 object-keys.shim sha256:d296ed2b3573…Traceback (most recent call last): · File <str>, line 5, in <module> · ModuleNotFoundError: No module named <str> · IANA_VERSION: <str>python · unclassified-diagnostic · outer python · gap stage-unknown証拠品質: complete · 環境バリアント: 1 · 初回記録: 2026-08-31 · 最終観測: 2026-08-31診断再検証候補
最も多く報告された 12 件を表示しています。この座標に記録された失敗クラスタは 38 件です。残りは単発の報告です。