Registrosnpmobject-assign4.1.1
Cambiar las condiciones
Condiciones actuales
object-assign @4.1.1ubuntu glibc · x64 · node 22 · yarn 4 · node
total del paquete, no una API
4 de 4 pasaron
Observado: builds reales de proyectos reportaron desde esta coordenada.
hay una muestra aquí y todavía no la hemos ejecutado en esta coordenada (2)
- Observaciones de proyectos
- 4 / 4
- Verificaciones de contrato
- nada en esta coordenada
- Peers independientes que reportaron
- 1
- Último registro
- 2026-09-07
Evidencia que puedes abrir
Salud de dependencias
Una resolución leyó el árbol de esta versión y no encontró dependencias. Es una medición, no una que falte.
Clústeres de fallos recientes
-
observado PROJECT_PROCESS ERR_MODULE_NOT_FOUND Brecha de evidencia ×3 4.1.1 executionContext=nodeCalidad de evidencia: legacy-evidence-incomplete · Variantes de entorno: 2 · Primer registro: 2026-08-14 · Última observación: 2026-08-21Candidato a reverificación diagnóstica
-
observado UNKNOWN exit 1 ERR_ASSERTION Brecha de evidencia ×2 4.1.1 executionContext=node · os=linux · runtime=node@22.23 sha256:986d98189e70…node:internal/modules/run_main:<n> · triggerUncaughtException( · ^ · AssertionError [ERR_ASSERTION]: Expected values to be strictly equal:node · unclassified-diagnostic · outer node · gap stage-unknownCalidad de evidencia: complete · Variantes de entorno: 2 · Primer registro: 2026-08-31 · Última observación: 2026-09-14Candidato a reverificación diagnóstica
-
observado UNKNOWN exit 1 ERR_ASSERTION Brecha de evidencia ×1 4.1.1 executionContext=node · moduleSystem=cjs · os=linux · runtime=node@22.23 sha256:b5be31ef74e1…Contract test failed: AssertionError [ERR_ASSERTION]: Preflight allowed headers must match · + actual - expected · + <str> · - <str>node · unclassified-diagnostic · outer node · gap stage-unknownCalidad de evidencia: complete · Variantes de entorno: 1 · Primer registro: 2026-08-30 · Última observación: 2026-08-30Candidato a reverificación diagnóstica
-
observado UNKNOWN exit 1 Brecha de evidencia ×1 4.1.1 executionContext=node · moduleSystem=cjs · os=linux · runtime=node@22.23 sha256:9be950af9140…Traceback (most recent call last): · File <str>, line 1, in <module> · ModuleNotFoundError: No module named <str>python3 · unclassified-diagnostic · outer python3 · gap stage-unknownCalidad de evidencia: complete · Variantes de entorno: 1 · Primer registro: 2026-08-31 · Última observación: 2026-08-31Candidato a reverificación diagnóstica