Registrosnpmobject-assign4.1.1
Mudar as condições
Condições atuais
object-assign @4.1.1ubuntu glibc · x64 · node 22 · npm 10 · node
total do pacote, não uma API
0 de 4 passaram
Verificado — esta rede executou um contrato nesta coordenada.
há uma amostra aqui e nossa execução nesta coordenada falhou (2)
- Observações de projetos
- 46 / 48
- Verificações de contrato
- 0 / 4
- Registros de uso
- 37
- Peers independentes que reportaram
- 2
- Falhas com impressão digital capturada
- 1 / 2
- Último registro
- 2026-10-21
Evidências que você pode abrir
Saúde das dependências
Uma resolução leu a árvore desta versão e não encontrou dependências. Isso é uma medição, não uma medição ausente.
Clusters de falha recentes
-
observado PROJECT_PROCESS ERR_MODULE_NOT_FOUND Lacuna de evidência ×3 4.1.1 executionContext=nodeQualidade da evidência: legacy-evidence-incomplete · Variantes de ambiente: 2 · Primeiro registro: 2026-08-14 · Visto por último: 2026-08-21Candidato a reverificação diagnóstica
-
observado UNKNOWN exit 1 ERR_ASSERTION Lacuna de evidência ×2 4.1.1 executionContext=node · os=linux · runtime=node@22.23 sha256:986d98189e70…node:internal/modules/run_main:<n> · triggerUncaughtException( · ^ · AssertionError [ERR_ASSERTION]: Expected values to be strictly equal:node · unclassified-diagnostic · outer node · gap stage-unknownQualidade da evidência: complete · Variantes de ambiente: 2 · Primeiro registro: 2026-08-31 · Visto por último: 2026-09-14Candidato a reverificação diagnóstica
-
observado UNKNOWN exit 1 ERR_ASSERTION Lacuna de evidência ×1 4.1.1 executionContext=node · moduleSystem=cjs · os=linux · runtime=node@22.23 sha256:b5be31ef74e1…Contract test failed: AssertionError [ERR_ASSERTION]: Preflight allowed headers must match · + actual - expected · + <str> · - <str>node · unclassified-diagnostic · outer node · gap stage-unknownQualidade da evidência: complete · Variantes de ambiente: 1 · Primeiro registro: 2026-08-30 · Visto por último: 2026-08-30Candidato a reverificação diagnóstica
-
observado UNKNOWN exit 1 Lacuna de evidência ×1 4.1.1 executionContext=node · moduleSystem=cjs · os=linux · runtime=node@22.23 sha256:9be950af9140…Traceback (most recent call last): · File <str>, line 1, in <module> · ModuleNotFoundError: No module named <str>python3 · unclassified-diagnostic · outer python3 · gap stage-unknownQualidade da evidência: complete · Variantes de ambiente: 1 · Primeiro registro: 2026-08-31 · Visto por último: 2026-08-31Candidato a reverificação diagnóstica
-
observado PROJECT_TEST exit 1 ERR_ASSERTION ×1 4.1.1 executionContext=node · moduleSystem=esm · os=linux · runtime=node@22.23 sha256:ef96efaca8dd…AssertionError [ERR_ASSERTION]: Expected values to be strictly equal: · undefined !== 123 · at <url> …javascript/test-runner · test-runner-diagnostic · outer npm testQualidade da evidência: complete · Variantes de ambiente: 1 · Primeiro registro: 2026-10-21 · Visto por último: 2026-10-21