記録npmminimist1.2.8
条件を変更
現在の条件
minimist @1.2.8windows 11 · x64 · node 24 · pnpm 10 · node
API ではなくパッケージ全体の合計
220 回中 0 回が成功
検証 — このネットワークがこの座標でコントラクトを実行しました。
サンプルあり — この座標で実行し、失敗した (1)
- プロジェクト観測
- 287 / 378
- コントラクト検証
- 0 / 220
- 使用記録
- 1,198
- 独立した報告ピア
- 1
- fingerprint を収集した失敗
- 90 / 91
- 最終記録
- 2026-09-16
開ける証拠
依存関係のヘルス
ある解決処理がこのリリースのツリーを読み、依存関係はありませんでした。欠落ではなく測定結果です。
最近の失敗クラスター
-
観測済み UNKNOWN exit 1 ERR_PNPM_RECURSIVE_RUN_FIRST_FAIL 証拠の欠落 ×31 1.2.8 executionContext=node · moduleSystem=esm · os=windows · runtime=node@24.13 sha256:9f91c9753081…(node:<n>) ExperimentalWarning: SQLite is an experimental feature and might change at any time …pnpm · unclassified-diagnostic · outer pnpm · gap stage-unknown証拠品質: complete · 環境バリアント: 1 · 初回記録: 2026-09-01 · 最終観測: 2026-09-15診断再検証候補
-
観測済み UNKNOWN exit 1 ERR_PNPM_RECURSIVE_EXEC_FIRST_FAIL 証拠の欠落 ×28 1.2.8 executionContext=node · moduleSystem=esm · os=windows · runtime=node@24.13 sha256:979755e6489d…(node:<n>) ExperimentalWarning: SQLite is an experimental feature and might change at any time …pnpm · unclassified-diagnostic · outer pnpm · gap stage-unknown証拠品質: complete · 環境バリアント: 1 · 初回記録: 2026-09-01 · 最終観測: 2026-09-15診断再検証候補
-
観測済み UNKNOWN exit 1 ERR_PNPM_RECURSIVE_EXEC_FIRST_FAIL 証拠の欠落 ×11 1.2.8 executionContext=node · moduleSystem=esm · os=windows · runtime=node@24.13 sha256:73873d2c4aed…<str> is not recognized as an internal or external command, · operable program or batch file. · undefined …pnpm · unclassified-diagnostic · outer pnpm · gap stage-unknown証拠品質: complete · 環境バリアント: 1 · 初回記録: 2026-09-01 · 最終観測: 2026-09-01診断再検証候補
-
観測済み PROJECT_TEST exit 1 ELIFECYCLE ×10 1.2.8 executionContext=node · moduleSystem=esm · os=windows · runtime=node@24.13 sha256:7711694d48fa…ELIFECYCLE Test failed. See above for more details.javascript/test-runner · test-runner-diagnostic · outer pnpm test証拠品質: complete · 環境バリアント: 1 · 初回記録: 2026-08-29 · 最終観測: 2026-09-01
-
観測済み UNKNOWN exit 1 ELIFECYCLE 証拠の欠落 ×7 1.2.8 executionContext=node · moduleSystem=esm · os=windows · runtime=node@24.13 sha256:f398b989dbea…> devhotel-workspace@0.4.3 lint <path> · > eslint . · <path> …pnpm · unclassified-diagnostic · outer pnpm · gap stage-unknown証拠品質: complete · 環境バリアント: 1 · 初回記録: 2026-09-01 · 最終観測: 2026-09-01診断再検証候補
-
観測済み UNKNOWN exit 1 ERR_PNPM_RECURSIVE_RUN_FIRST_FAIL 証拠の欠落 ×5 1.2.8 executionContext=node · moduleSystem=esm · os=windows · runtime=node@24.13 sha256:0c4a78e30813…> devhotel-workspace@0.5.2 typecheck <path> · > pnpm -r typecheck · Scope: 4 of 5 workspace projects · packages/shared typecheck$ tsc --noEmitpnpm · unclassified-diagnostic · outer pnpm · gap stage-unknown証拠品質: complete · 環境バリアント: 1 · 初回記録: 2026-09-13 · 最終観測: 2026-09-13診断再検証候補
-
観測済み UNKNOWN exit 1 証拠の欠落 ×5 1.2.8 executionContext=node · moduleSystem=cjs · os=windows · runtime=node@24.13 sha256:bc4d7ddc5bcd…node:internal/modules/cjs/loader:<n> · throw err; · ^ · Error: Cannot find module <str>npm · unclassified-diagnostic · outer npm run · gap stage-unknown証拠品質: complete · 環境バリアント: 1 · 初回記録: 2026-09-13 · 最終観測: 2026-09-15診断再検証候補
-
観測済み UNKNOWN exit 1 ERR_PNPM_RECURSIVE_EXEC_FIRST_FAIL 証拠の欠落 ×4 1.2.8 executionContext=node · moduleSystem=esm · os=windows · runtime=node@24.13 sha256:d53178e9c23b…<str> is not recognized as an internal or external command, · operable program or batch file. · undefined · <path>pnpm · unclassified-diagnostic · outer pnpm · gap stage-unknown証拠品質: complete · 環境バリアント: 1 · 初回記録: 2026-08-29 · 最終観測: 2026-09-15診断再検証候補
-
観測済み UNKNOWN exit 1 ERR_PNPM_RECURSIVE_RUN_FIRST_FAIL 証拠の欠落 ×4 1.2.8 executionContext=node · moduleSystem=esm · os=windows · runtime=node@24.13 sha256:3b99548df64e…> devhotel-workspace@0.4.3 typecheck <path> · > pnpm -r typecheck · Scope: 4 of 5 workspace projects · packages/shared typecheck$ tsc --noEmitpnpm · unclassified-diagnostic · outer pnpm · gap stage-unknown証拠品質: complete · 環境バリアント: 1 · 初回記録: 2026-09-01 · 最終観測: 2026-09-01診断再検証候補
-
観測済み PROJECT_COMPILE exit 2 TS2307 ×4 1.2.8 executionContext=node · moduleSystem=cjs · os=windows · runtime=node@24.13 sha256:0470f88d95bb…lib/hooks/queries/index.ts(<n>,<n>): error TS2307: Cannot find module <str> or its corresponding type declarations. …typescript/tsc · compiler-diagnostic証拠品質: complete · 環境バリアント: 1 · 初回記録: 2026-09-01 · 最終観測: 2026-09-01
-
観測済み PROJECT_COMPILE exit 2 TS7006 ×4 1.2.8 executionContext=node · moduleSystem=cjs · os=windows · runtime=node@24.13 sha256:21025cd78572…app/api/politicians/[id]/real-estates/route.ts(<n>,<n>): error TS7006: Parameter <str> implicitly has an <str> type. …typescript/tsc · compiler-diagnostic証拠品質: complete · 環境バリアント: 1 · 初回記録: 2026-09-01 · 最終観測: 2026-09-01
-
観測済み PROJECT_COMPILE exit 2 TS2561 ×4 1.2.8 executionContext=node · moduleSystem=cjs · os=windows · runtime=node@24.13 sha256:5f96e966539e…app/api/politicians/[id]/real-estates/route.ts(<n>,<n>): error TS2561: Object literal may only specify known properties, but <str> does not exist in type …typescript/tsc · compiler-diagnostic証拠品質: complete · 環境バリアント: 1 · 初回記録: 2026-09-01 · 最終観測: 2026-09-01
最も多く報告された 12 件を表示しています。この座標に記録された失敗クラスタは 298 件です。残りは単発の報告です。