Registrosnpmmagic-string0.30.21
Cambiar las condiciones
Condiciones actuales
magic-string @0.30.21windows 11 · x64 · node 24 · pnpm 10 · node
total del paquete, no una API
0 de 229 pasaron
Verificado: esta red ejecutó un contrato en esta coordenada.
hay una muestra aquí y nuestra ejecución en esta coordenada falló (1)
- Observaciones de proyectos
- 326 / 424
- Verificaciones de contrato
- 0 / 229
- Registros de uso
- 1.256
- Peers independientes que reportaron
- 1
- Fallos con huella capturada
- 95 / 98
- Último registro
- 2026-09-26
Salud de dependencias
Combinaciones observadas y evidencia de fallos para esta versión
Primer fallo observado
0.30.21
windows · node@24.13 · moduleSystem=esm · executionContext=node
32 FAIL
· stage: UNKNOWN
· fingerprint: sha256:9f91c975308128a0f4f23e33b9d5936b9c39535b5c01aa9245b8cdc4b0a37a10
| Biblioteca | Versión | Estado | Medido allí | Proyectos |
|---|---|---|---|---|
| @jridgewell/sourcemap-codec | 1.5.5 | PASS Todas las observaciones pasaron | contrato aprobado | 26 días-proyecto |
| @jridgewell/sourcemap-codec | 1.6.0 | PASS Todas las observaciones pasaron | contrato aprobado | 85 días-proyecto |
La columna de medición se refiere a la versión de cada dependencia en sí, no al par. Que un resolutor haya colocado dos versiones juntas no prueba que funcionen juntas.
Versiones de dependencias por versión
A qué resolvió sus hijos cada versión de este paquete. Primero va el hijo cuya versión se movió: ahí una actualización cambió algo bajo tus pies.
| Biblioteca | 0.30.21 | 0.30.8 |
|---|---|---|
| @jridgewell/sourcemap-codec | 1.5.5 | 1.5.5 |
Se movieron: 0 · iguales en todas las versiones: 1
Una arista registra que un resolutor colocó una versión junto a otra en una máquina real. No afirma que ambas funcionen juntas; a esa pregunta responden las muestras y los contratos, no la presencia de una fila.
Clústeres de fallos recientes
-
observado UNKNOWN exit 1 ERR_PNPM_RECURSIVE_RUN_FIRST_FAIL Brecha de evidencia ×32 0.30.21 executionContext=node · moduleSystem=esm · os=windows · runtime=node@24.13 sha256:9f91c9753081…(node:<n>) ExperimentalWarning: SQLite is an experimental feature and might change at any time …pnpm · unclassified-diagnostic · outer pnpm · gap stage-unknownCalidad de evidencia: complete · Variantes de entorno: 1 · Primer registro: 2026-09-01 · Última observación: 2026-09-17Candidato a reverificación diagnóstica
-
observado UNKNOWN exit 1 ERR_PNPM_RECURSIVE_EXEC_FIRST_FAIL Brecha de evidencia ×28 0.30.21 executionContext=node · moduleSystem=esm · os=windows · runtime=node@24.13 sha256:979755e6489d…(node:<n>) ExperimentalWarning: SQLite is an experimental feature and might change at any time …pnpm · unclassified-diagnostic · outer pnpm · gap stage-unknownCalidad de evidencia: complete · Variantes de entorno: 1 · Primer registro: 2026-09-01 · Última observación: 2026-09-15Candidato a reverificación diagnóstica
-
observado PROCESS_START process start failed Brecha de evidencia ×18 0.30.21 executionContext=node sha256:c12549970456…· structured-termination · gap diagnostic-missingCalidad de evidencia: partial · Variantes de entorno: 3 · Primer registro: 2026-08-30 · Última observación: 2026-09-16Candidato a reverificación diagnóstica
-
observado UNKNOWN exit 1 ERR_PNPM_RECURSIVE_EXEC_FIRST_FAIL Brecha de evidencia ×11 0.30.21 executionContext=node · moduleSystem=esm · os=windows · runtime=node@24.13 sha256:73873d2c4aed…<str> is not recognized as an internal or external command, · operable program or batch file. · undefined …pnpm · unclassified-diagnostic · outer pnpm · gap stage-unknownCalidad de evidencia: complete · Variantes de entorno: 1 · Primer registro: 2026-09-01 · Última observación: 2026-09-01Candidato a reverificación diagnóstica
-
observado PROJECT_TEST exit 1 ELIFECYCLE ×10 0.30.21 executionContext=node · moduleSystem=esm · os=windows · runtime=node@24.13 sha256:7711694d48fa…ELIFECYCLE Test failed. See above for more details.javascript/test-runner · test-runner-diagnostic · outer pnpm testCalidad de evidencia: complete · Variantes de entorno: 1 · Primer registro: 2026-08-29 · Última observación: 2026-09-01
-
observado PROJECT_PROCESS ERR_ASSERTION Brecha de evidencia ×8 0.30.21 executionContext=nodeCalidad de evidencia: legacy-evidence-incomplete · Variantes de entorno: 3 · Primer registro: 2026-08-14 · Última observación: 2026-08-30Candidato a reverificación diagnóstica
-
observado PROJECT_COMPILE exit 2 TS2307 ×8 0.30.8 → 0.30.21 executionContext=node · moduleSystem=cjs · os=windows · runtime=node@24.13 sha256:0470f88d95bb…lib/hooks/queries/index.ts(<n>,<n>): error TS2307: Cannot find module <str> or its corresponding type declarations. …typescript/tsc · compiler-diagnosticCalidad de evidencia: complete · Variantes de entorno: 1 · Primer registro: 2026-09-01 · Última observación: 2026-09-01
-
observado PROJECT_COMPILE exit 2 TS7006 ×8 0.30.8 → 0.30.21 executionContext=node · moduleSystem=cjs · os=windows · runtime=node@24.13 sha256:21025cd78572…app/api/politicians/[id]/real-estates/route.ts(<n>,<n>): error TS7006: Parameter <str> implicitly has an <str> type. …typescript/tsc · compiler-diagnosticCalidad de evidencia: complete · Variantes de entorno: 1 · Primer registro: 2026-09-01 · Última observación: 2026-09-01
-
observado PROJECT_COMPILE exit 2 TS2561 ×8 0.30.8 → 0.30.21 executionContext=node · moduleSystem=cjs · os=windows · runtime=node@24.13 sha256:5f96e966539e…app/api/politicians/[id]/real-estates/route.ts(<n>,<n>): error TS2561: Object literal may only specify known properties, but <str> does not exist in type …typescript/tsc · compiler-diagnosticCalidad de evidencia: complete · Variantes de entorno: 1 · Primer registro: 2026-09-01 · Última observación: 2026-09-01
-
observado PROJECT_COMPILE exit 2 TS2345 ×8 0.30.8 → 0.30.21 executionContext=node · moduleSystem=cjs · os=windows · runtime=node@24.13 sha256:7e077f646acc…lib/api/real-estate-statistics.ts(<n>,<n>): error TS2345: Argument of type <str> is not assignable to parameter of type <str>.typescript/tsc · compiler-diagnosticCalidad de evidencia: complete · Variantes de entorno: 1 · Primer registro: 2026-09-01 · Última observación: 2026-09-01
-
observado PROJECT_COMPILE exit 2 TS2551 ×8 0.30.8 → 0.30.21 executionContext=node · moduleSystem=cjs · os=windows · runtime=node@24.13 sha256:8a1ebc675f2b…app/api/politicians/[id]/real-estates/route.ts(<n>,<n>): error TS2551: Property <str> does not exist on type <str>. Did you mean <str>? …typescript/tsc · compiler-diagnosticCalidad de evidencia: complete · Variantes de entorno: 1 · Primer registro: 2026-09-01 · Última observación: 2026-09-01
-
observado PROJECT_COMPILE exit 2 TS2339 ×8 0.30.8 → 0.30.21 executionContext=node · moduleSystem=cjs · os=windows · runtime=node@24.13 sha256:e51205820175…lib/api/real-estate-map-addresses.ts(<n>,<n>): error TS2339: Property <str> does not exist on type <str>.typescript/tsc · compiler-diagnosticCalidad de evidencia: complete · Variantes de entorno: 1 · Primer registro: 2026-09-01 · Última observación: 2026-09-01
Se muestran los 12 más reportados de 274 grupos de fallos registrados. El resto son reportes únicos.