Registrosnpmlowercase-keys2.0.0
Mudar as condições
Condições atuais
lowercase-keys @2.0.0ubuntu glibc · x64 · node 22 · npm 10 · node
total do pacote, não uma API
0 de 78 passaram
Verificado — esta rede executou um contrato nesta coordenada.
há uma amostra aqui e nossa execução nesta coordenada falhou (1)
- Observações de projetos
- 108 / 113
- Verificações de contrato
- 0 / 78
- Registros de uso
- 205
- Peers independentes que reportaram
- 3
- Falhas com impressão digital capturada
- 1 / 5
- Último registro
- 2026-09-08
Evidências que você pode abrir
Saúde das dependências
Uma resolução leu a árvore desta versão e não encontrou dependências. Isso é uma medição, não uma medição ausente.
Clusters de falha recentes
-
observado UNKNOWN exit 1 Lacuna de evidência ×19 2.0.0 executionContext=node · moduleSystem=cjs · os=linux · runtime=node@22.23 sha256:9be950af9140…Traceback (most recent call last): · File <str>, line 1, in <module> · ModuleNotFoundError: No module named <str>python3 · unclassified-diagnostic · outer python3 · gap stage-unknownQualidade da evidência: complete · Variantes de ambiente: 1 · Primeiro registro: 2026-08-30 · Visto por último: 2026-09-02Candidato a reverificação diagnóstica
-
observado PROCESS_START process start failed Lacuna de evidência ×8 2.0.0 executionContext=node sha256:c12549970456…· structured-termination · gap diagnostic-missingQualidade da evidência: partial · Variantes de ambiente: 2 · Primeiro registro: 2026-08-30 · Visto por último: 2026-09-16Candidato a reverificação diagnóstica
-
observado UNKNOWN exit 1 Lacuna de evidência ×5 2.0.0 executionContext=node · moduleSystem=cjs · os=linux · runtime=node@22.23 sha256:72ba2d1e946f…<path>: No module named pippython3 · unclassified-diagnostic · outer python3 · gap stage-unknownQualidade da evidência: complete · Variantes de ambiente: 1 · Primeiro registro: 2026-08-31 · Visto por último: 2026-09-02Candidato a reverificação diagnóstica
-
observado PROJECT_PROCESS Lacuna de evidência ×4 2.0.0 executionContext=node · moduleSystem=cjs · os=linux · runtime=node@22.23Qualidade da evidência: legacy-evidence-incomplete · Variantes de ambiente: 1 · Primeiro registro: 2026-08-29 · Visto por último: 2026-08-29Candidato a reverificação diagnóstica
-
observado UNKNOWN exit 2 Lacuna de evidência ×4 2.0.0 executionContext=node · moduleSystem=cjs · os=linux · runtime=node@22.23 sha256:fddf8ea09045…Using CPython 3.12.3 interpreter at: <path> · Creating virtual environment at: .venv · error: Failed to create virtual environment …· unclassified-diagnostic · gap stage-unknownQualidade da evidência: complete · Variantes de ambiente: 1 · Primeiro registro: 2026-08-30 · Visto por último: 2026-08-31Candidato a reverificação diagnóstica
-
observado UNKNOWN exit 1 ERR_ASSERTION Lacuna de evidência ×3 2.0.0 executionContext=node · moduleSystem=cjs · os=linux · runtime=node@22.23 sha256:986d98189e70…node:internal/modules/run_main:<n> · triggerUncaughtException( · ^ · AssertionError [ERR_ASSERTION]: Expected values to be strictly equal:node · unclassified-diagnostic · outer node · gap stage-unknownQualidade da evidência: complete · Variantes de ambiente: 1 · Primeiro registro: 2026-08-30 · Visto por último: 2026-09-02Candidato a reverificação diagnóstica
-
observado UNKNOWN exit 1 Lacuna de evidência ×2 2.0.0 executionContext=node · moduleSystem=cjs · os=linux · runtime=node@22.23 sha256:91ad26545eb1…node:internal/modules/cjs/loader:<n> · throw err; · ^ · Error: Cannot find module <str>node · unclassified-diagnostic · outer node · gap stage-unknownQualidade da evidência: complete · Variantes de ambiente: 1 · Primeiro registro: 2026-08-30 · Visto por último: 2026-08-31Candidato a reverificação diagnóstica
-
observado UNKNOWN exit 2 Lacuna de evidência ×2 2.0.0 executionContext=node · moduleSystem=cjs · os=linux · runtime=node@22.23 sha256:5bb159dc4015…usage: -c [-h] [--port int] · -c: error: unrecognized arguments: -p 4000· unclassified-diagnostic · gap stage-unknownQualidade da evidência: complete · Variantes de ambiente: 1 · Primeiro registro: 2026-09-02 · Visto por último: 2026-09-02Candidato a reverificação diagnóstica
-
observado UNKNOWN exit 1 Lacuna de evidência ×2 2.0.0 executionContext=node · moduleSystem=cjs · os=linux · runtime=node@22.23 sha256:7789edf7d3db…<path> · <path> · <path>· unclassified-diagnostic · gap stage-unknownQualidade da evidência: complete · Variantes de ambiente: 1 · Primeiro registro: 2026-09-02 · Visto por último: 2026-09-02Candidato a reverificação diagnóstica
-
observado UNKNOWN exit 2 EVERYTHING Lacuna de evidência ×2 2.0.0 executionContext=node · moduleSystem=cjs · os=linux · runtime=node@22.23 sha256:d29a2deca319…csx sample: unknown subcommand <str> · usage: csx sample <subcommand> · propose --goal G [--package purl]... [--symbol s]... …· unclassified-diagnostic · gap stage-unknownQualidade da evidência: complete · Variantes de ambiente: 1 · Primeiro registro: 2026-09-02 · Visto por último: 2026-09-02Candidato a reverificação diagnóstica
-
observado UNKNOWN exit 1 Lacuna de evidência ×1 2.0.0 executionContext=node · moduleSystem=cjs · os=linux · runtime=node@22.23 sha256:6370f8688b49…Contract test failed: Error: Cannot find module <str> · Require stack: · - <path> · - <path>node · unclassified-diagnostic · outer node · gap stage-unknownQualidade da evidência: complete · Variantes de ambiente: 1 · Primeiro registro: 2026-08-29 · Visto por último: 2026-08-29Candidato a reverificação diagnóstica
-
observado UNKNOWN exit 1 ERR_ASSERTION Lacuna de evidência ×1 2.0.0 executionContext=node · moduleSystem=cjs · os=linux · runtime=node@22.23 sha256:f326878dcad5…AssertionError [ERR_ASSERTION]: App declaration must contain <str> method · at runTests (<path>:<n>:<n>) · at Object.<anonymous> (<path>:<n>:<n>) …node · unclassified-diagnostic · outer node · gap stage-unknownQualidade da evidência: complete · Variantes de ambiente: 1 · Primeiro registro: 2026-08-29 · Visto por último: 2026-08-29Candidato a reverificação diagnóstica
Mostrando os 12 mais relatados de 44 grupos de falhas registrados. O resto são relatos únicos.