Recordsnpmloupe3.2.1loupe.registerStringTag
Change the conditions
Current conditions
loupe.registerStringTag @3.2.1ubuntu glibc · x64 · node 22 · npm 10 · node
0 of 3 passed
Verified — this network ran a contract at this coordinate.
there is a sample here, and our run of it at this coordinate failed
- Project observations
- 1 / 1
- Contract verifications
- 0 / 3
- Independent reporting peers
- 1
- Last recorded
- 2026-08-31
Evidence you can open
Dependency Health
A resolution read this release's tree and found no dependencies. That is a measurement, not a missing one.
Recent failure clusters
-
observed PROCESS_START process start failed Evidence gap ×14 3.2.1 executionContext=node sha256:c12549970456…· structured-termination · gap diagnostic-missingEvidence quality: partial · Environment variants: 3 · First recorded: 2026-08-31 · Last seen: 2026-09-16Diagnostic re-verification candidate
-
observed PROJECT_PROCESS ERR_ASSERTION Evidence gap ×6 3.2.1 executionContext=node · os=linux · runtime=node@22.23Evidence quality: legacy-evidence-incomplete · Environment variants: 2 · First recorded: 2026-08-21 · Last seen: 2026-08-30Diagnostic re-verification candidate
-
observed UNKNOWN exit 1 ERR_ASSERTION Evidence gap ×5 3.2.1 executionContext=node · os=linux · runtime=node@22.23 sha256:986d98189e70…node:internal/modules/run_main:<n> · triggerUncaughtException( · ^ · AssertionError [ERR_ASSERTION]: Expected values to be strictly equal:node · unclassified-diagnostic · outer node · gap stage-unknownEvidence quality: complete · Environment variants: 2 · First recorded: 2026-08-31 · Last seen: 2026-09-06Diagnostic re-verification candidate
-
observed UNKNOWN exit 1 ERR_ASSERTION Evidence gap ×3 3.2.1 executionContext=node · moduleSystem=cjs · os=linux · runtime=node@22.23 loupe.registerStringTag sha256:986d98189e70…node:internal/modules/run_main:<n> · triggerUncaughtException( · ^ · AssertionError [ERR_ASSERTION]: Expected values to be strictly equal:node · unclassified-diagnostic · outer node · gap stage-unknownEvidence quality: complete · Environment variants: 1 · First recorded: 2026-08-31 · Last seen: 2026-08-31Diagnostic re-verification candidate
-
observed UNKNOWN exit 1 Evidence gap ×3 3.2.1 executionContext=node · moduleSystem=esm · os=linux · runtime=node@22.23 sha256:8fd30f2a6304…fil<path>:<n> · throw new Error(errorMsg); · ^ · Error: Vitest failed to access its internal state.node · unclassified-diagnostic · outer node · gap stage-unknownEvidence quality: complete · Environment variants: 1 · First recorded: 2026-08-31 · Last seen: 2026-09-08Diagnostic re-verification candidate
-
observed UNKNOWN exit 1 Evidence gap ×2 3.2.1 executionContext=node · moduleSystem=esm · os=linux · runtime=node@22.23 sha256:42623a56826f…fil<path>:<n> · Object.defineProperty(expect.not, expectAssertionName, { · ^ · TypeError: Object.defineProperty called on non-objectnode · unclassified-diagnostic · outer node · gap stage-unknownEvidence quality: complete · Environment variants: 1 · First recorded: 2026-09-03 · Last seen: 2026-09-04Diagnostic re-verification candidate
-
observed UNKNOWN exit 1 Evidence gap ×2 3.2.1 executionContext=node · moduleSystem=cjs · os=linux · runtime=node@22.23 sha256:3b3190f2cd44…doc: cannot find package <str> in any of: · ($GOROOT not set) · <path> (from $GOPATH)go · unclassified-diagnostic · outer go · gap stage-unknownEvidence quality: complete · Environment variants: 1 · First recorded: 2026-09-04 · Last seen: 2026-09-04Diagnostic re-verification candidate
-
observed UNKNOWN exit 1 Evidence gap ×2 3.2.1 executionContext=node · moduleSystem=cjs · os=linux · runtime=node@22.23 sha256:f0288eb0529f…Traceback (most recent call last): · File <str>, line 19, in <module> · AssertionError· unclassified-diagnostic · gap stage-unknownEvidence quality: complete · Environment variants: 1 · First recorded: 2026-09-04 · Last seen: 2026-09-04Diagnostic re-verification candidate
-
observed UNKNOWN exit 1 Evidence gap ×1 3.2.1 executionContext=node · moduleSystem=esm · os=linux · runtime=node@22.23 sha256:9d8e5c918329…Contract test failed: AssertionError: value must be typeof object: expected Map{} to be an object · at checkTypeAndInstance (<url>) …node · unclassified-diagnostic · outer node · gap stage-unknownEvidence quality: complete · Environment variants: 1 · First recorded: 2026-08-30 · Last seen: 2026-08-30Diagnostic re-verification candidate
-
observed UNKNOWN exit 1 Evidence gap ×1 3.2.1 executionContext=node · moduleSystem=cjs · os=linux · runtime=node@22.23 sha256:72ba2d1e946f…<path>: No module named pippython3 · unclassified-diagnostic · outer python3 · gap stage-unknownEvidence quality: complete · Environment variants: 1 · First recorded: 2026-08-31 · Last seen: 2026-08-31Diagnostic re-verification candidate
-
observed UNKNOWN exit 1 Evidence gap ×1 3.2.1 executionContext=node · moduleSystem=cjs · os=linux · runtime=node@22.23 sha256:91ad26545eb1…node:internal/modules/cjs/loader:<n> · throw err; · ^ · Error: Cannot find module <str>node · unclassified-diagnostic · outer node · gap stage-unknownEvidence quality: complete · Environment variants: 1 · First recorded: 2026-08-31 · Last seen: 2026-08-31Diagnostic re-verification candidate
-
observed UNKNOWN exit 1 Evidence gap ×1 3.2.1 executionContext=node · moduleSystem=cjs · os=linux · runtime=node@22.23 sha256:d7f5d491441c…Traceback (most recent call last): · File <str>, line 71, in <module> · AssertionError: is_annotated must return True for Annotated· unclassified-diagnostic · gap stage-unknownEvidence quality: complete · Environment variants: 1 · First recorded: 2026-08-31 · Last seen: 2026-08-31Diagnostic re-verification candidate
Showing the 12 most-reported of 22 recorded failure clusters. The rest are single reports.