Recordsnpmlodash.escaperegexp4.1.2lodash.escaperegexp
Change the conditions
Current conditions
lodash.escaperegexp @4.1.2alpine musl · x64 · node 22 · npm · node
1 of 1 passed
Verified — this network ran a contract at this coordinate.
there is a sample here, and our run of it at this coordinate came back clean (1)
- Project observations
- nothing at this coordinate
- Contract verifications
- 1 / 1
- Last recorded
- 2026-08-28
Evidence you can open
Dependency Health
A resolution read this release's tree and found no dependencies. That is a measurement, not a missing one.
Recent failure clusters
-
observed UNKNOWN exit 1 Evidence gap ×3 4.1.2 executionContext=node · moduleSystem=cjs · os=linux · runtime=node@22.23 sha256:91ad26545eb1…node:internal/modules/cjs/loader:<n> · throw err; · ^ · Error: Cannot find module <str>node · unclassified-diagnostic · outer node · gap stage-unknownEvidence quality: complete · Environment variants: 1 · First recorded: 2026-08-29 · Last seen: 2026-08-30Diagnostic re-verification candidate
-
observed PROJECT_TEST exit 1 ERR_ASSERTION ×2 4.1.2 executionContext=node · moduleSystem=cjs · os=linux · runtime=node@22.23 sha256:45fc70285a65…Contract test failed: AssertionError [ERR_ASSERTION]: DOWNLOAD_PROGRESS event should have fired · false !== true · at main (<path>:<n>:<n>) { …javascript/test-runner · test-runner-diagnostic · outer npm testEvidence quality: complete · Environment variants: 1 · First recorded: 2026-08-29 · Last seen: 2026-08-29
-
observed UNKNOWN exit 1 Evidence gap ×1 4.1.2 executionContext=node · moduleSystem=cjs · os=linux · runtime=node@22.23 sha256:8310a83be884…node:internal/modules/cjs/loader:<n> · const err = new Error(message); · ^ · Error: Cannot find module <str>node · unclassified-diagnostic · outer node · gap stage-unknownEvidence quality: complete · Environment variants: 1 · First recorded: 2026-08-29 · Last seen: 2026-08-29Diagnostic re-verification candidate
-
observed UNKNOWN exit 1 ERR_MODULE_NOT_FOUND Evidence gap ×1 4.1.2 executionContext=node · moduleSystem=cjs · os=linux · runtime=node@22.23 sha256:88af852f99a8…node:internal/modules/package_json_reader:<n> · throw new ERR_MODULE_NOT_FOUND(packageName, fileURLToPath(base), null); · ^ …node · unclassified-diagnostic · outer node · gap stage-unknownEvidence quality: complete · Environment variants: 1 · First recorded: 2026-08-29 · Last seen: 2026-08-29Diagnostic re-verification candidate
-
observed UNKNOWN exit 1 Evidence gap ×1 4.1.2 executionContext=node · moduleSystem=cjs · os=linux · runtime=node@22.23 sha256:8e2ccedae0ba…Contract test failed: TypeError: this.doDownloadUpdate is not a function · at CustomBaseUpdater.downloadUpdate <path>:<n>:<n>) · at main (<path>:<n>:<n>) …node · unclassified-diagnostic · outer node · gap stage-unknownEvidence quality: complete · Environment variants: 1 · First recorded: 2026-08-29 · Last seen: 2026-08-29Diagnostic re-verification candidate
-
observed UNKNOWN exit 1 Evidence gap ×1 4.1.2 executionContext=node · moduleSystem=cjs · os=linux · runtime=node@22.23 sha256:91bb8f54cd90…Contract test failed: Error: Command node exited with code 2 · at CustomBaseUpdater.spawnSyncLog <path>:<n>:<n>) · at main (<path>:<n>:<n>) …node · unclassified-diagnostic · outer node · gap stage-unknownEvidence quality: complete · Environment variants: 1 · First recorded: 2026-08-29 · Last seen: 2026-08-29Diagnostic re-verification candidate
-
observed UNKNOWN exit 1 Evidence gap ×1 4.1.2 executionContext=node · moduleSystem=cjs · os=linux · runtime=node@22.23 sha256:9922ca80f240…go: <path> already existsgo · unclassified-diagnostic · outer go mod · gap stage-unknownEvidence quality: complete · Environment variants: 1 · First recorded: 2026-08-29 · Last seen: 2026-08-29Diagnostic re-verification candidate
-
observed UNKNOWN exit 1 ERR_ASSERTION Evidence gap ×1 4.1.2 executionContext=node · moduleSystem=cjs · os=linux · runtime=node@22.23 sha256:07e974cf28d4…Test failed: AssertionError [ERR_ASSERTION]: getFeedURL should return configured feed url · + actual - expected · + <str> · - <str>node · unclassified-diagnostic · outer node · gap stage-unknownEvidence quality: complete · Environment variants: 1 · First recorded: 2026-08-30 · Last seen: 2026-08-30Diagnostic re-verification candidate
-
observed UNKNOWN exit 1 ERR_ASSERTION Evidence gap ×1 4.1.2 executionContext=node · moduleSystem=cjs · os=linux · runtime=node@22.23 sha256:092c90ad7c9c…Contract test failed: AssertionError [ERR_ASSERTION]: setting empty channel must throw ERR_UPDATER_INVALID_CHANNEL · at run (<path>:<n>:<n>) …node · unclassified-diagnostic · outer node · gap stage-unknownEvidence quality: complete · Environment variants: 1 · First recorded: 2026-08-30 · Last seen: 2026-08-30Diagnostic re-verification candidate
-
observed UNKNOWN exit 1 Evidence gap ×1 4.1.2 executionContext=node · moduleSystem=cjs · os=linux · runtime=node@22.23 sha256:1c03ca490615…Traceback (most recent call last): · File <str>, line 3, in <module> · AttributeError: module <str> has no attribute <str> · IANA_VERSION: <str>python · unclassified-diagnostic · outer python · gap stage-unknownEvidence quality: complete · Environment variants: 1 · First recorded: 2026-08-30 · Last seen: 2026-08-30Diagnostic re-verification candidate
-
observed UNKNOWN exit 1 Evidence gap ×1 4.1.2 executionContext=node · moduleSystem=cjs · os=linux · runtime=node@22.23 sha256:9be950af9140…Traceback (most recent call last): · File <str>, line 1, in <module> · ModuleNotFoundError: No module named <str>python3 · unclassified-diagnostic · outer python3 · gap stage-unknownEvidence quality: complete · Environment variants: 1 · First recorded: 2026-08-30 · Last seen: 2026-08-30Diagnostic re-verification candidate
-
observed UNKNOWN exit 1 Evidence gap ×1 4.1.2 executionContext=node · moduleSystem=cjs · os=linux · runtime=node@22.23 sha256:d296ed2b3573…Traceback (most recent call last): · File <str>, line 5, in <module> · ModuleNotFoundError: No module named <str> · IANA_VERSION: <str>python · unclassified-diagnostic · outer python · gap stage-unknownEvidence quality: complete · Environment variants: 1 · First recorded: 2026-08-30 · Last seen: 2026-08-30Diagnostic re-verification candidate
Showing the 12 most-reported of 13 recorded failure clusters. The rest are single reports.