Registrosnpmlodash.escaperegexp4.1.2
Cambiar las condiciones
Condiciones actuales
lodash.escaperegexp @4.1.2ubuntu glibc · x64 · node 22 · npm 10 · node
total del paquete, no una API
0 de 14 pasaron
Verificado: esta red ejecutó un contrato en esta coordenada.
hay una muestra aquí y nuestra ejecución en esta coordenada falló (1)
- Observaciones de proyectos
- 18 / 20
- Verificaciones de contrato
- 0 / 14
- Registros de uso
- 27
- Peers independientes que reportaron
- 3
- Último registro
- 2026-09-14
Evidencia que puedes abrir
Salud de dependencias
Una resolución leyó el árbol de esta versión y no encontró dependencias. Es una medición, no una que falte.
Clústeres de fallos recientes
-
observado UNKNOWN exit 1 Brecha de evidencia ×3 4.1.2 executionContext=node · moduleSystem=cjs · os=linux · runtime=node@22.23 sha256:91ad26545eb1…node:internal/modules/cjs/loader:<n> · throw err; · ^ · Error: Cannot find module <str>node · unclassified-diagnostic · outer node · gap stage-unknownCalidad de evidencia: complete · Variantes de entorno: 1 · Primer registro: 2026-08-29 · Última observación: 2026-08-30Candidato a reverificación diagnóstica
-
observado PROJECT_TEST exit 1 ERR_ASSERTION ×2 4.1.2 executionContext=node · moduleSystem=cjs · os=linux · runtime=node@22.23 sha256:45fc70285a65…Contract test failed: AssertionError [ERR_ASSERTION]: DOWNLOAD_PROGRESS event should have fired · false !== true · at main (<path>:<n>:<n>) { …javascript/test-runner · test-runner-diagnostic · outer npm testCalidad de evidencia: complete · Variantes de entorno: 1 · Primer registro: 2026-08-29 · Última observación: 2026-08-29
-
observado UNKNOWN exit 1 Brecha de evidencia ×1 4.1.2 executionContext=node · moduleSystem=cjs · os=linux · runtime=node@22.23 sha256:8310a83be884…node:internal/modules/cjs/loader:<n> · const err = new Error(message); · ^ · Error: Cannot find module <str>node · unclassified-diagnostic · outer node · gap stage-unknownCalidad de evidencia: complete · Variantes de entorno: 1 · Primer registro: 2026-08-29 · Última observación: 2026-08-29Candidato a reverificación diagnóstica
-
observado UNKNOWN exit 1 ERR_MODULE_NOT_FOUND Brecha de evidencia ×1 4.1.2 executionContext=node · moduleSystem=cjs · os=linux · runtime=node@22.23 sha256:88af852f99a8…node:internal/modules/package_json_reader:<n> · throw new ERR_MODULE_NOT_FOUND(packageName, fileURLToPath(base), null); · ^ …node · unclassified-diagnostic · outer node · gap stage-unknownCalidad de evidencia: complete · Variantes de entorno: 1 · Primer registro: 2026-08-29 · Última observación: 2026-08-29Candidato a reverificación diagnóstica
-
observado UNKNOWN exit 1 Brecha de evidencia ×1 4.1.2 executionContext=node · moduleSystem=cjs · os=linux · runtime=node@22.23 sha256:8e2ccedae0ba…Contract test failed: TypeError: this.doDownloadUpdate is not a function · at CustomBaseUpdater.downloadUpdate <path>:<n>:<n>) · at main (<path>:<n>:<n>) …node · unclassified-diagnostic · outer node · gap stage-unknownCalidad de evidencia: complete · Variantes de entorno: 1 · Primer registro: 2026-08-29 · Última observación: 2026-08-29Candidato a reverificación diagnóstica
-
observado UNKNOWN exit 1 Brecha de evidencia ×1 4.1.2 executionContext=node · moduleSystem=cjs · os=linux · runtime=node@22.23 sha256:91bb8f54cd90…Contract test failed: Error: Command node exited with code 2 · at CustomBaseUpdater.spawnSyncLog <path>:<n>:<n>) · at main (<path>:<n>:<n>) …node · unclassified-diagnostic · outer node · gap stage-unknownCalidad de evidencia: complete · Variantes de entorno: 1 · Primer registro: 2026-08-29 · Última observación: 2026-08-29Candidato a reverificación diagnóstica
-
observado UNKNOWN exit 1 Brecha de evidencia ×1 4.1.2 executionContext=node · moduleSystem=cjs · os=linux · runtime=node@22.23 sha256:9922ca80f240…go: <path> already existsgo · unclassified-diagnostic · outer go mod · gap stage-unknownCalidad de evidencia: complete · Variantes de entorno: 1 · Primer registro: 2026-08-29 · Última observación: 2026-08-29Candidato a reverificación diagnóstica
-
observado UNKNOWN exit 1 ERR_ASSERTION Brecha de evidencia ×1 4.1.2 executionContext=node · moduleSystem=cjs · os=linux · runtime=node@22.23 sha256:07e974cf28d4…Test failed: AssertionError [ERR_ASSERTION]: getFeedURL should return configured feed url · + actual - expected · + <str> · - <str>node · unclassified-diagnostic · outer node · gap stage-unknownCalidad de evidencia: complete · Variantes de entorno: 1 · Primer registro: 2026-08-30 · Última observación: 2026-08-30Candidato a reverificación diagnóstica
-
observado UNKNOWN exit 1 ERR_ASSERTION Brecha de evidencia ×1 4.1.2 executionContext=node · moduleSystem=cjs · os=linux · runtime=node@22.23 sha256:092c90ad7c9c…Contract test failed: AssertionError [ERR_ASSERTION]: setting empty channel must throw ERR_UPDATER_INVALID_CHANNEL · at run (<path>:<n>:<n>) …node · unclassified-diagnostic · outer node · gap stage-unknownCalidad de evidencia: complete · Variantes de entorno: 1 · Primer registro: 2026-08-30 · Última observación: 2026-08-30Candidato a reverificación diagnóstica
-
observado UNKNOWN exit 1 Brecha de evidencia ×1 4.1.2 executionContext=node · moduleSystem=cjs · os=linux · runtime=node@22.23 sha256:1c03ca490615…Traceback (most recent call last): · File <str>, line 3, in <module> · AttributeError: module <str> has no attribute <str> · IANA_VERSION: <str>python · unclassified-diagnostic · outer python · gap stage-unknownCalidad de evidencia: complete · Variantes de entorno: 1 · Primer registro: 2026-08-30 · Última observación: 2026-08-30Candidato a reverificación diagnóstica
-
observado UNKNOWN exit 1 Brecha de evidencia ×1 4.1.2 executionContext=node · moduleSystem=cjs · os=linux · runtime=node@22.23 sha256:9be950af9140…Traceback (most recent call last): · File <str>, line 1, in <module> · ModuleNotFoundError: No module named <str>python3 · unclassified-diagnostic · outer python3 · gap stage-unknownCalidad de evidencia: complete · Variantes de entorno: 1 · Primer registro: 2026-08-30 · Última observación: 2026-08-30Candidato a reverificación diagnóstica
-
observado UNKNOWN exit 1 Brecha de evidencia ×1 4.1.2 executionContext=node · moduleSystem=cjs · os=linux · runtime=node@22.23 sha256:d296ed2b3573…Traceback (most recent call last): · File <str>, line 5, in <module> · ModuleNotFoundError: No module named <str> · IANA_VERSION: <str>python · unclassified-diagnostic · outer python · gap stage-unknownCalidad de evidencia: complete · Variantes de entorno: 1 · Primer registro: 2026-08-30 · Última observación: 2026-08-30Candidato a reverificación diagnóstica
Se muestran los 12 más reportados de 13 grupos de fallos registrados. El resto son reportes únicos.