Записиnpmlightningcss1.33.0lightningcss.bundle
Изменить условия
Текущие условия
lightningcss.bundle @1.33.0ubuntu glibc · x64 · node 22 · npm 10 · node
2 из 2 прошли
Наблюдение — реальные сборки проектов сообщили об этой координате.
образец есть — в этой координате мы его ещё не запускали (2)
- Наблюдения в проектах
- 2 / 2
- Проверки контрактом
- в этой координате ничего
- Независимые сообщившие пиры
- 1
- Последняя запись
- 2026-09-05
Здоровье зависимостей
Наблюдаемые комбинации и свидетельства сбоев для этого выпуска
Первый обнаруженный сбой
1.33.0
windows · node@24.13 · moduleSystem=esm · executionContext=node
3 FAIL · stage: PROJECT_PROCESS
| Библиотека | Версия | Состояние | Измерено там | Проектов |
|---|---|---|---|---|
| detect-libc | 2.1.2 | PASS Все наблюдения прошли успешно | контракт пройден | 15 проектных дней |
Столбец измерения относится к релизу самой зависимости, а не к паре. То, что резолвер поставил два релиза рядом, не доказывает, что они работают вместе.
Версии зависимостей по выпускам
К чему каждый выпуск этого пакета разрешил своих потомков. Потомок, чья версия сдвинулась, идёт первым: там обновление изменило что-то под вами.
| Библиотека | 1.33.0 | 1.32.0 |
|---|---|---|
| detect-libc | 2.1.2 | 2.1.2 |
Сдвинулось: 0 · одинаково во всех выпусках: 1
Ребро фиксирует, что резолвер поставил один релиз рядом с другим на реальной машине. Это не утверждение, что они работают вместе; на этот вопрос отвечают образцы и контракты, а не наличие строки.
Недавние кластеры сбоев
-
наблюдалось PROJECT_TEST exit 1 ERR_LOAD_URL ×1 1.33.0 executionContext=node · moduleSystem=esm · os=linux · runtime=node@22.23 sha256:a60e7101af87…Contract test failed: Error: Failed to load custom Reporter from basic · at loadCustomReporterModule (fil<path>:<n>:<n>) · at fil<path>:<n>:<n> …javascript/test-runner · test-runner-diagnostic · outer npm testКачество данных: complete · Варианты среды: 1 · Первая запись: 2026-08-31 · Последнее наблюдение: 2026-08-31
-
наблюдалось UNKNOWN exit 1 Пробел в данных ×1 1.33.0 executionContext=node · moduleSystem=esm · os=linux · runtime=node@22.23 sha256:0ce61af3f1a8…<url>]:<n> · const res = await babelPlugin.transform.handler(code, <str>); · ^ · TypeError: Cannot read properties of undefined (reading <str>)node · unclassified-diagnostic · outer node · gap stage-unknownКачество данных: complete · Варианты среды: 1 · Первая запись: 2026-09-01 · Последнее наблюдение: 2026-09-01Кандидат на диагностическую перепроверку
-
наблюдалось UNKNOWN exit 1 Пробел в данных ×1 1.33.0 executionContext=node · moduleSystem=esm · os=linux · runtime=node@22.23 sha256:249ecd4b894f…fil<path>:<n> · skipFastRefresh = isProduction || config.command === <str> || config.server.hmr === false; · ^ …node · unclassified-diagnostic · outer node · gap stage-unknownКачество данных: complete · Варианты среды: 1 · Первая запись: 2026-09-01 · Последнее наблюдение: 2026-09-01Кандидат на диагностическую перепроверку
-
наблюдалось UNKNOWN exit 1 Пробел в данных ×1 1.33.0 executionContext=node · moduleSystem=esm · os=linux · runtime=node@22.23 sha256:8a6df6b44383…fil<path>:<n> · if (config.experimental.bundledDev) isBundledDev = true; · ^ · TypeError: Cannot read properties of undefined (reading <str>)node · unclassified-diagnostic · outer node · gap stage-unknownКачество данных: complete · Варианты среды: 1 · Первая запись: 2026-09-01 · Последнее наблюдение: 2026-09-01Кандидат на диагностическую перепроверку
-
наблюдалось UNKNOWN exit 1 ERR_ASSERTION Пробел в данных ×1 1.33.0 executionContext=node · moduleSystem=esm · os=linux · runtime=node@22.23 sha256:8b0e67a45c04…node:internal/modules/run_main:<n> · triggerUncaughtException( · ^ · AssertionError [ERR_ASSERTION]: resolves <path> to virtual module IDnode · unclassified-diagnostic · outer node · gap stage-unknownКачество данных: complete · Варианты среды: 1 · Первая запись: 2026-09-01 · Последнее наблюдение: 2026-09-01Кандидат на диагностическую перепроверку
-
наблюдалось UNKNOWN exit 1 ERR_ASSERTION Пробел в данных ×1 1.33.0 executionContext=node · moduleSystem=esm · os=linux · runtime=node@22.23 sha256:9088da2c451a…node:internal/modules/run_main:<n> · triggerUncaughtException( · ^ · AssertionError [ERR_ASSERTION]: load code contains RefreshRuntimenode · unclassified-diagnostic · outer node · gap stage-unknownКачество данных: complete · Варианты среды: 1 · Первая запись: 2026-09-01 · Последнее наблюдение: 2026-09-01Кандидат на диагностическую перепроверку
-
наблюдалось UNKNOWN exit 1 Пробел в данных ×1 1.33.0 executionContext=node · moduleSystem=esm · os=linux · runtime=node@22.23 sha256:aaa882de0091…fil<path>:<n> · const hooks = config.plugins.map((plugin) => plugin.api?.reactBabel).filter(defined); · ^ …node · unclassified-diagnostic · outer node · gap stage-unknownКачество данных: complete · Варианты среды: 1 · Первая запись: 2026-09-01 · Последнее наблюдение: 2026-09-01Кандидат на диагностическую перепроверку
-
наблюдалось UNKNOWN exit 1 ERR_PACKAGE_PATH_NOT_EXPORTED Пробел в данных ×1 1.33.0 executionContext=node · moduleSystem=esm · os=linux · runtime=node@22.23 sha256:b9a7518ba7bb…node:internal/modules/esm/resolve:<n> · return new ERR_PACKAGE_PATH_NOT_EXPORTED( · ^ …node · unclassified-diagnostic · outer node · gap stage-unknownКачество данных: complete · Варианты среды: 1 · Первая запись: 2026-09-01 · Последнее наблюдение: 2026-09-01Кандидат на диагностическую перепроверку
-
наблюдалось UNKNOWN exit 1 ERR_ASSERTION Пробел в данных ×1 1.33.0 executionContext=node · moduleSystem=cjs · os=linux · runtime=node@22.23 sha256:986d98189e70…node:internal/modules/run_main:<n> · triggerUncaughtException( · ^ · AssertionError [ERR_ASSERTION]: Expected values to be strictly equal:node · unclassified-diagnostic · outer node · gap stage-unknownКачество данных: complete · Варианты среды: 1 · Первая запись: 2026-09-04 · Последнее наблюдение: 2026-09-04Кандидат на диагностическую перепроверку
-
наблюдалось UNKNOWN exit 1 ERR_PACKAGE_PATH_NOT_EXPORTED Пробел в данных ×1 1.33.0 executionContext=node · moduleSystem=cjs · os=linux · runtime=node@22.23 sha256:e72340c7e3d4…node:internal/modules/cjs/loader:<n> · throw e; · ^ · Error [ERR_PACKAGE_PATH_NOT_EXPORTED]: Package subpath <str> is not defined by <str> in <path>node · unclassified-diagnostic · outer node · gap stage-unknownКачество данных: complete · Варианты среды: 1 · Первая запись: 2026-09-04 · Последнее наблюдение: 2026-09-04Кандидат на диагностическую перепроверку