記録npmip-address10.7.0Address6.isInSubnet
条件を変更
現在の条件
Address6.isInSubnet @10.7.0debian glibc · x64 · node 22 · npm · node
1 回中 1 回が成功
検証 — このネットワークがこの座標でコントラクトを実行しました。
サンプルあり — この座標で実行し、問題なく終わった (1)
- プロジェクト観測
- 1 / 1
- コントラクト検証
- 1 / 1
- 独立した報告ピア
- 1
- 最終記録
- 2026-09-17
開ける証拠
依存関係のヘルス
ある解決処理がこのリリースのツリーを読み、依存関係はありませんでした。欠落ではなく測定結果です。
最近の失敗クラスター
-
観測済み UNKNOWN exit 1 証拠の欠落 ×6 10.4.0 → 10.5.0 → 10.7.0 executionContext=node · moduleSystem=cjs · os=linux · runtime=node@22.23 sha256:91ad26545eb1…node:internal/modules/cjs/loader:<n> · throw err; · ^ · Error: Cannot find module <str>node · unclassified-diagnostic · outer node · gap stage-unknown証拠品質: complete · 環境バリアント: 1 · 初回記録: 2026-08-30 · 最終観測: 2026-09-07診断再検証候補
-
観測済み UNKNOWN exit 1 証拠の欠落 ×1 10.7.0 executionContext=node · moduleSystem=cjs · os=linux · runtime=node@22.23 sha256:d2d7a684aeb0…<url>]:<n> · console.log(<str>, addr.toBigInt().toString(16)); · ^ · TypeError: addr.toBigInt is not a functionnode · unclassified-diagnostic · outer node · gap stage-unknown証拠品質: complete · 環境バリアント: 1 · 初回記録: 2026-09-07 · 最終観測: 2026-09-07診断再検証候補
-
観測済み UNKNOWN exit 1 証拠の欠落 ×1 10.7.0 executionContext=node · moduleSystem=cjs · os=linux · runtime=node@22.23 sha256:e5f751e72b4c…<path>:<n> · if (address.indexOf(<str>) === -1) { · ^ · TypeError: address.indexOf is not a functionnode · unclassified-diagnostic · outer node · gap stage-unknown証拠品質: complete · 環境バリアント: 1 · 初回記録: 2026-09-07 · 最終観測: 2026-09-07診断再検証候補
-
観測済み UNKNOWN exit 1 ERR_ASSERTION 証拠の欠落 ×1 10.7.0 executionContext=node · moduleSystem=cjs · os=linux · runtime=node@22.23 sha256:0ab3a7004d66…node:assert:<n> · throw new AssertionError(obj); · ^ · AssertionError [ERR_ASSERTION]: Expected values to be strictly equal:node · unclassified-diagnostic · outer node · gap stage-unknown証拠品質: complete · 環境バリアント: 1 · 初回記録: 2026-09-07 · 最終観測: 2026-09-07診断再検証候補
-
観測済み UNKNOWN exit 1 ERR_ASSERTION 証拠の欠落 ×1 10.7.0 executionContext=node · moduleSystem=cjs · os=linux · runtime=node@22.23 sha256:0d62cac8c07a…AssertionError [ERR_ASSERTION]: Expected values to be strictly equal: · + actual - expected · + <str> · - <str>node · unclassified-diagnostic · outer node · gap stage-unknown証拠品質: complete · 環境バリアント: 1 · 初回記録: 2026-09-07 · 最終観測: 2026-09-07診断再検証候補
-
観測済み UNKNOWN exit 1 証拠の欠落 ×1 10.7.0 executionContext=node · moduleSystem=cjs · os=linux · runtime=node@22.23 sha256:2f5423e9a8a8…<path>:<n> · assert.equal(mapped.isValid(), true); · ^ · TypeError: mapped.isValid is not a functionnode · unclassified-diagnostic · outer node · gap stage-unknown証拠品質: complete · 環境バリアント: 1 · 初回記録: 2026-09-07 · 最終観測: 2026-09-07診断再検証候補
-
観測済み UNKNOWN exit 1 ERR_ASSERTION 証拠の欠落 ×1 10.7.0 executionContext=node · moduleSystem=cjs · os=linux · runtime=node@22.23 sha256:719dc399517f…AssertionError [ERR_ASSERTION]: Expected values to be strictly equal: · 8080 !== 38853 · at runTests (<path>:<n>:<n>) …node · unclassified-diagnostic · outer node · gap stage-unknown証拠品質: complete · 環境バリアント: 1 · 初回記録: 2026-09-07 · 最終観測: 2026-09-07診断再検証候補
-
観測済み UNKNOWN exit 1 ERR_ASSERTION 証拠の欠落 ×1 10.7.0 executionContext=node · moduleSystem=cjs · os=linux · runtime=node@22.23 sha256:821bb102fcd0…node:assert:<n> · throw err; · ^ · AssertionError [ERR_ASSERTION]: The input did not match the regular expression <path> of the internal SmartBuffer/. Input:node · unclassified-diagnostic · outer node · gap stage-unknown証拠品質: complete · 環境バリアント: 1 · 初回記録: 2026-09-07 · 最終観測: 2026-09-07診断再検証候補
-
観測済み UNKNOWN exit 1 ERR_ASSERTION 証拠の欠落 ×1 10.7.0 executionContext=node · moduleSystem=cjs · os=linux · runtime=node@22.23 sha256:cf0f5652a811…Contract test failed: AssertionError [ERR_ASSERTION]: should reject non-connect command · at async testContract (<url>) { · generatedMessage: false, …node · unclassified-diagnostic · outer node · gap stage-unknown証拠品質: complete · 環境バリアント: 1 · 初回記録: 2026-09-07 · 最終観測: 2026-09-07診断再検証候補