Relevésnpmhasown2.0.4
Changer les conditions
Conditions actuelles
hasown @2.0.4debian glibc · x64 · node 22 · npm · node
total du paquet, pas une API
Enregistré comme présent dans des projets. Rien n'a été exécuté à cette coordonnée.
Observé — de vrais builds de projets ont fait remonter cette coordonnée.
il y a un échantillon ici et nous ne l'avons pas encore exécuté à cette coordonnée (1)
- Observations de projets
- rien à cette coordonnée
- Vérifications de contrat
- rien à cette coordonnée
- Enregistrements d'usage
- 15
- Pairs rapporteurs indépendants
- 1
- Dernier enregistrement
- 2026-09-14
Santé des dépendances
Combinaisons observées et preuves d'échec pour cette version
Premier échec observé
2.0.4
windows · node@24.13 · moduleSystem=esm · executionContext=node
31 FAIL
· stage: UNKNOWN
· fingerprint: sha256:9f91c975308128a0f4f23e33b9d5936b9c39535b5c01aa9245b8cdc4b0a37a10
| Bibliothèque | Version | Santé | Mesuré là-bas | Projets |
|---|---|---|---|---|
| function-bind | 1.1.2 | PASS Toutes les observations ont réussi | contrat réussi | 129 jours-projet |
La colonne de mesure porte sur la version de chaque dépendance elle-même, pas sur la paire. Qu'un résolveur ait placé deux versions côte à côte ne prouve pas qu'elles fonctionnent ensemble.
Versions des dépendances au fil des versions
Ce vers quoi chaque version de ce paquet a résolu ses enfants. L'enfant dont la version a bougé vient en premier : c'est là qu'une mise à jour a changé quelque chose sous vos pieds.
| Bibliothèque | 2.0.4 | 2.0.2 |
|---|---|---|
| function-bind | 1.1.2 | 1.1.2 |
Ont bougé : 0 · identiques à chaque version : 1
Une arête indique qu'un résolveur a placé une version à côté d'une autre sur une machine réelle. Ce n'est pas une affirmation qu'elles fonctionnent ensemble ; à cette question répondent les échantillons et les contrats, pas la présence d'une ligne.
Clusters d'échecs récents
-
observé PROJECT_PROCESS ERR_MODULE_NOT_FOUND Lacune de preuve ×20 2.0.4 executionContext=nodeQualité de preuve: legacy-evidence-incomplete · Variantes d’environnement: 2 · Premier relevé: 2026-08-13 · Dernière observation: 2026-08-21Candidat à une revérification diagnostique
-
observé UNKNOWN exit 1 ERR_MODULE_NOT_FOUND Lacune de preuve ×5 2.0.4 executionContext=node · moduleSystem=cjs · os=linux · runtime=node@22.23 sha256:88af852f99a8…node:internal/modules/package_json_reader:<n> · throw new ERR_MODULE_NOT_FOUND(packageName, fileURLToPath(base), null); · ^ …node · unclassified-diagnostic · outer node · gap stage-unknownQualité de preuve: complete · Variantes d’environnement: 1 · Premier relevé: 2026-09-03 · Dernière observation: 2026-09-05Candidat à une revérification diagnostique
-
observé PROCESS_START process start failed Lacune de preuve ×4 2.0.4 executionContext=node sha256:c12549970456…· structured-termination · gap diagnostic-missingQualité de preuve: partial · Variantes d’environnement: 3 · Premier relevé: 2026-09-05 · Dernière observation: 2026-09-16Candidat à une revérification diagnostique
-
observé UNKNOWN exit 1 ERR_ASSERTION Lacune de preuve ×3 2.0.4 executionContext=node · os=linux · runtime=node@22.23 sha256:986d98189e70…node:internal/modules/run_main:<n> · triggerUncaughtException( · ^ · AssertionError [ERR_ASSERTION]: Expected values to be strictly equal:node · unclassified-diagnostic · outer node · gap stage-unknownQualité de preuve: complete · Variantes d’environnement: 2 · Premier relevé: 2026-08-31 · Dernière observation: 2026-09-03Candidat à une revérification diagnostique
-
observé UNKNOWN exit 1 Lacune de preuve ×3 2.0.4 executionContext=node · moduleSystem=cjs · os=linux · runtime=node@22.23 sha256:3b3190f2cd44…doc: cannot find package <str> in any of: · ($GOROOT not set) · <path> (from $GOPATH)go · unclassified-diagnostic · outer go · gap stage-unknownQualité de preuve: complete · Variantes d’environnement: 1 · Premier relevé: 2026-09-04 · Dernière observation: 2026-09-05Candidat à une revérification diagnostique
-
observé UNKNOWN exit 1 Lacune de preuve ×2 2.0.4 executionContext=node · moduleSystem=cjs · os=linux · runtime=node@22.23 sha256:91ad26545eb1…node:internal/modules/cjs/loader:<n> · throw err; · ^ · Error: Cannot find module <str>node · unclassified-diagnostic · outer node · gap stage-unknownQualité de preuve: complete · Variantes d’environnement: 1 · Premier relevé: 2026-08-31 · Dernière observation: 2026-08-31Candidat à une revérification diagnostique
-
observé UNKNOWN exit 1 Lacune de preuve ×2 2.0.4 executionContext=node · moduleSystem=cjs · os=linux · runtime=node@22.23 sha256:f0288eb0529f…Traceback (most recent call last): · File <str>, line 19, in <module> · AssertionError· unclassified-diagnostic · gap stage-unknownQualité de preuve: complete · Variantes d’environnement: 1 · Premier relevé: 2026-09-04 · Dernière observation: 2026-09-04Candidat à une revérification diagnostique
-
observé UNKNOWN exit 1 Lacune de preuve ×1 2.0.4 executionContext=node · moduleSystem=esm · os=linux · runtime=node@22.23 sha256:795cbb5ee086…Error: Cannot find module <str> · Require stack: · - <path> · - <path>node · unclassified-diagnostic · outer node · gap stage-unknownQualité de preuve: complete · Variantes d’environnement: 1 · Premier relevé: 2026-08-30 · Dernière observation: 2026-08-30Candidat à une revérification diagnostique
-
observé UNKNOWN exit 1 Lacune de preuve ×1 2.0.4 executionContext=node · moduleSystem=cjs · os=linux · runtime=node@22.23 sha256:0c06875294a4…Contract test failed: TypeError: Cannot read properties of undefined (reading <str>) · at runContract (<url>) …node · unclassified-diagnostic · outer node · gap stage-unknownQualité de preuve: complete · Variantes d’environnement: 1 · Premier relevé: 2026-08-30 · Dernière observation: 2026-08-30Candidat à une revérification diagnostique
-
observé UNKNOWN exit 1 ERR_ASSERTION Lacune de preuve ×1 2.0.4 executionContext=node · moduleSystem=cjs · os=linux · runtime=node@22.23 sha256:0d62cac8c07a…AssertionError [ERR_ASSERTION]: Expected values to be strictly equal: · + actual - expected · + <str> · - <str>node · unclassified-diagnostic · outer node · gap stage-unknownQualité de preuve: complete · Variantes d’environnement: 1 · Premier relevé: 2026-08-30 · Dernière observation: 2026-08-30Candidat à une revérification diagnostique
-
observé UNKNOWN exit 1 Lacune de preuve ×1 2.0.4 executionContext=node · moduleSystem=cjs · os=linux · runtime=node@22.23 sha256:9630b514e713…Contract test failed: TypeError: this.terminate is not a function · at ProgressBar.set currentAmount [as currentAmount] <path>:<n>:<n>) …node · unclassified-diagnostic · outer node · gap stage-unknownQualité de preuve: complete · Variantes d’environnement: 1 · Premier relevé: 2026-08-30 · Dernière observation: 2026-08-30Candidat à une revérification diagnostique
-
observé UNKNOWN exit 1 ERR_ASSERTION Lacune de preuve ×1 2.0.4 executionContext=node · moduleSystem=cjs · os=linux · runtime=node@22.23 sha256:9ed50b51742b…Contract test failed: AssertionError [ERR_ASSERTION]: Expected values to be strictly equal: · 0 !== 50 · at runContract (<url>) …node · unclassified-diagnostic · outer node · gap stage-unknownQualité de preuve: complete · Variantes d’environnement: 1 · Premier relevé: 2026-08-30 · Dernière observation: 2026-08-30Candidat à une revérification diagnostique
Affichage des 12 plus signalés parmi 44 groupes d’échecs enregistrés. Le reste sont des signalements uniques.