기록npmglobal-agent3.0.0bootstrap
조건 변경
현재 조건
bootstrap @3.0.0alpine musl · x64 · node 22 · npm · node
1회 중 1회 통과
검증 — 이 네트워크가 이 좌표에서 컨트랙트를 직접 실행했습니다.
샘플 있음 — 이 좌표에서 우리가 실행했고 통과함 (1)
- 프로젝트 관측
- 이 좌표에는 없음
- 컨트랙트 검증
- 1 / 1
- 마지막 기록
- 2026-08-26
열어 볼 수 있는 증거
의존성 건강도
이 릴리스의 의존성 조합과 실패 관측 결과
관측된 문제 1건 ·
정상 7건
| 라이브러리 | 버전 | 건강도 | 그 좌표에서 측정된 것 | 프로젝트 |
|---|---|---|---|---|
| boolean | 3.2.0 | PASS 모든 관측 정상 통과 | 컨트랙트 통과 | 프로젝트-일 23개 |
| es6-error | 4.1.1 | PASS 모든 관측 정상 통과 | 컨트랙트 통과 | 프로젝트-일 23개 |
| matcher | 3.0.0 | PASS 모든 관측 정상 통과 | 컨트랙트 통과 | 프로젝트-일 23개 |
| roarr | 2.15.4 | PASS 모든 관측 정상 통과 | 컨트랙트 통과 | 프로젝트-일 23개 |
| semver | 7.7.4 | PASS 모든 관측 정상 통과 | 컨트랙트 통과 | 프로젝트-일 7개 |
| semver | 7.8.5 | PASS 모든 관측 정상 통과 | 컨트랙트 통과 | 프로젝트-일 19개 |
| serialize-error | 7.0.1 | PASS 모든 관측 정상 통과 | 컨트랙트 통과 | 프로젝트-일 22개 |
측정 열은 각 의존성 자신의 릴리스에 대한 것이지 두 릴리스의 조합에 대한 것이 아닙니다. 리졸버가 둘을 나란히 놓았다는 사실은 함께 동작한다는 증거가 아닙니다.
최근 실패 클러스터
-
관측됨 UNKNOWN exit 1 증거 공백 ×12 3.0.0 executionContext=node · moduleSystem=cjs · os=linux · runtime=node@22.23 sha256:9be950af9140…Traceback (most recent call last): · File <str>, line 1, in <module> · ModuleNotFoundError: No module named <str>python3 · unclassified-diagnostic · outer python3 · gap stage-unknown증거 품질: complete · 환경 변형: 1 · 최초 관측: 2026-08-31 · 마지막 관측: 2026-08-31진단 재검증 후보
-
관측됨 PROCESS_START process start failed 증거 공백 ×6 3.0.0 executionContext=node sha256:c12549970456…· structured-termination · gap diagnostic-missing증거 품질: partial · 환경 변형: 2 · 최초 관측: 2026-08-31 · 마지막 관측: 2026-09-16진단 재검증 후보
-
관측됨 PROJECT_PROCESS 증거 공백 ×4 3.0.0 executionContext=node · moduleSystem=cjs · os=linux · runtime=node@22.23증거 품질: legacy-evidence-incomplete · 환경 변형: 1 · 최초 관측: 2026-08-29 · 마지막 관측: 2026-08-29진단 재검증 후보
-
관측됨 UNKNOWN exit 1 증거 공백 ×4 3.0.0 executionContext=node · moduleSystem=cjs · os=linux · runtime=node@22.23 sha256:72ba2d1e946f…<path>: No module named pippython3 · unclassified-diagnostic · outer python3 · gap stage-unknown증거 품질: complete · 환경 변형: 1 · 최초 관측: 2026-08-31 · 마지막 관측: 2026-08-31진단 재검증 후보
-
관측됨 UNKNOWN exit 2 증거 공백 ×3 3.0.0 executionContext=node · moduleSystem=cjs · os=linux · runtime=node@22.23 sha256:fddf8ea09045…Using CPython 3.12.3 interpreter at: <path> · Creating virtual environment at: .venv · error: Failed to create virtual environment …· unclassified-diagnostic · gap stage-unknown증거 품질: complete · 환경 변형: 1 · 최초 관측: 2026-08-31 · 마지막 관측: 2026-08-31진단 재검증 후보
-
관측됨 UNKNOWN exit 1 증거 공백 ×1 3.0.0 executionContext=node · moduleSystem=cjs · os=linux · runtime=node@22.23 sha256:6370f8688b49…Contract test failed: Error: Cannot find module <str> · Require stack: · - <path> · - <path>node · unclassified-diagnostic · outer node · gap stage-unknown증거 품질: complete · 환경 변형: 1 · 최초 관측: 2026-08-29 · 마지막 관측: 2026-08-29진단 재검증 후보
-
관측됨 UNKNOWN exit 1 ERR_ASSERTION 증거 공백 ×1 3.0.0 executionContext=node · moduleSystem=cjs · os=linux · runtime=node@22.23 sha256:f326878dcad5…AssertionError [ERR_ASSERTION]: App declaration must contain <str> method · at runTests (<path>:<n>:<n>) · at Object.<anonymous> (<path>:<n>:<n>) …node · unclassified-diagnostic · outer node · gap stage-unknown증거 품질: complete · 환경 변형: 1 · 최초 관측: 2026-08-29 · 마지막 관측: 2026-08-29진단 재검증 후보
-
관측됨 UNKNOWN exit 1 ERR_ASSERTION 증거 공백 ×1 3.0.0 executionContext=node · moduleSystem=cjs · os=linux · runtime=node@22.23 sha256:0d62cac8c07a…AssertionError [ERR_ASSERTION]: Expected values to be strictly equal: · + actual - expected · + <str> · - <str>node · unclassified-diagnostic · outer node · gap stage-unknown증거 품질: complete · 환경 변형: 1 · 최초 관측: 2026-08-30 · 마지막 관측: 2026-08-30진단 재검증 후보
-
관측됨 UNKNOWN exit 1 증거 공백 ×1 3.0.0 executionContext=node · moduleSystem=cjs · os=linux · runtime=node@22.23 sha256:e1d65fc7c136…<path>:<n> · throw new Error(`Unsupported arch ${name}`) · ^ · Error: Unsupported arch 1node · unclassified-diagnostic · outer node · gap stage-unknown증거 품질: complete · 환경 변형: 1 · 최초 관측: 2026-08-30 · 마지막 관측: 2026-08-30진단 재검증 후보
-
관측됨 UNKNOWN exit 1 ERR_ASSERTION 증거 공백 ×1 3.0.0 executionContext=node · moduleSystem=cjs · os=linux · runtime=node@22.23 sha256:509afba8c7b2…node:assert:<n> · throw err; · ^ · AssertionError [ERR_ASSERTION]: The input did not match the regular expression <path> image path cannot be empty/. Input:node · unclassified-diagnostic · outer node · gap stage-unknown증거 품질: complete · 환경 변형: 1 · 최초 관측: 2026-08-31 · 마지막 관측: 2026-08-31진단 재검증 후보
-
관측됨 UNKNOWN exit 1 증거 공백 ×1 3.0.0 executionContext=node · moduleSystem=cjs · os=linux · runtime=node@22.23 sha256:13e610412b4d…<path> · <path>· unclassified-diagnostic · gap stage-unknown증거 품질: complete · 환경 변형: 1 · 최초 관측: 2026-08-31 · 마지막 관측: 2026-08-31진단 재검증 후보
-
관측됨 UNKNOWN exit 1 증거 공백 ×1 3.0.0 executionContext=node · moduleSystem=cjs · os=linux · runtime=node@22.23 sha256:1efba491e785…Traceback (most recent call last): · File <str>, line 153, in <module> · main() · File <str>, line 144, in mainpython3 · unclassified-diagnostic · outer python3 · gap stage-unknown증거 품질: complete · 환경 변형: 1 · 최초 관측: 2026-08-31 · 마지막 관측: 2026-08-31진단 재검증 후보
가장 많이 보고된 12개를 보여줍니다. 이 좌표에 기록된 실패 클러스터는 26개입니다. 나머지는 단발 보고입니다.