Relevésnpmglobal-agent3.0.0bootstrap
Changer les conditions
Conditions actuelles
bootstrap @3.0.0alpine musl · x64 · node 22 · npm · node
1 sur 1 ont réussi
Vérifié — ce réseau a exécuté un contrat à cette coordonnée.
il y a un échantillon ici et notre exécution à cette coordonnée s'est terminée proprement (1)
- Observations de projets
- rien à cette coordonnée
- Vérifications de contrat
- 1 / 1
- Dernier enregistrement
- 2026-08-26
Santé des dépendances
Combinaisons observées et preuves d'échec pour cette version
Premier échec observé
3.0.0
windows · node@24.13 · moduleSystem=esm · executionContext=node
32 FAIL
· stage: UNKNOWN
· fingerprint: sha256:9f91c975308128a0f4f23e33b9d5936b9c39535b5c01aa9245b8cdc4b0a37a10
| Bibliothèque | Version | Santé | Mesuré là-bas | Projets |
|---|---|---|---|---|
| boolean | 3.2.0 | PASS Toutes les observations ont réussi | contrat réussi | 23 jours-projet |
| es6-error | 4.1.1 | PASS Toutes les observations ont réussi | contrat réussi | 23 jours-projet |
| matcher | 3.0.0 | PASS Toutes les observations ont réussi | contrat réussi | 23 jours-projet |
| roarr | 2.15.4 | PASS Toutes les observations ont réussi | contrat réussi | 23 jours-projet |
| semver | 7.7.4 | PASS Toutes les observations ont réussi | contrat réussi | 7 jours-projet |
| semver | 7.8.5 | PASS Toutes les observations ont réussi | contrat réussi | 19 jours-projet |
| serialize-error | 7.0.1 | PASS Toutes les observations ont réussi | contrat réussi | 22 jours-projet |
La colonne de mesure porte sur la version de chaque dépendance elle-même, pas sur la paire. Qu'un résolveur ait placé deux versions côte à côte ne prouve pas qu'elles fonctionnent ensemble.
Clusters d'échecs récents
-
observé UNKNOWN exit 1 Lacune de preuve ×12 3.0.0 executionContext=node · moduleSystem=cjs · os=linux · runtime=node@22.23 sha256:9be950af9140…Traceback (most recent call last): · File <str>, line 1, in <module> · ModuleNotFoundError: No module named <str>python3 · unclassified-diagnostic · outer python3 · gap stage-unknownQualité de preuve: complete · Variantes d’environnement: 1 · Premier relevé: 2026-08-31 · Dernière observation: 2026-08-31Candidat à une revérification diagnostique
-
observé PROCESS_START process start failed Lacune de preuve ×6 3.0.0 executionContext=node sha256:c12549970456…· structured-termination · gap diagnostic-missingQualité de preuve: partial · Variantes d’environnement: 2 · Premier relevé: 2026-08-31 · Dernière observation: 2026-09-16Candidat à une revérification diagnostique
-
observé PROJECT_PROCESS Lacune de preuve ×4 3.0.0 executionContext=node · moduleSystem=cjs · os=linux · runtime=node@22.23Qualité de preuve: legacy-evidence-incomplete · Variantes d’environnement: 1 · Premier relevé: 2026-08-29 · Dernière observation: 2026-08-29Candidat à une revérification diagnostique
-
observé UNKNOWN exit 1 Lacune de preuve ×4 3.0.0 executionContext=node · moduleSystem=cjs · os=linux · runtime=node@22.23 sha256:72ba2d1e946f…<path>: No module named pippython3 · unclassified-diagnostic · outer python3 · gap stage-unknownQualité de preuve: complete · Variantes d’environnement: 1 · Premier relevé: 2026-08-31 · Dernière observation: 2026-08-31Candidat à une revérification diagnostique
-
observé UNKNOWN exit 2 Lacune de preuve ×3 3.0.0 executionContext=node · moduleSystem=cjs · os=linux · runtime=node@22.23 sha256:fddf8ea09045…Using CPython 3.12.3 interpreter at: <path> · Creating virtual environment at: .venv · error: Failed to create virtual environment …· unclassified-diagnostic · gap stage-unknownQualité de preuve: complete · Variantes d’environnement: 1 · Premier relevé: 2026-08-31 · Dernière observation: 2026-08-31Candidat à une revérification diagnostique
-
observé UNKNOWN exit 1 Lacune de preuve ×1 3.0.0 executionContext=node · moduleSystem=cjs · os=linux · runtime=node@22.23 sha256:6370f8688b49…Contract test failed: Error: Cannot find module <str> · Require stack: · - <path> · - <path>node · unclassified-diagnostic · outer node · gap stage-unknownQualité de preuve: complete · Variantes d’environnement: 1 · Premier relevé: 2026-08-29 · Dernière observation: 2026-08-29Candidat à une revérification diagnostique
-
observé UNKNOWN exit 1 ERR_ASSERTION Lacune de preuve ×1 3.0.0 executionContext=node · moduleSystem=cjs · os=linux · runtime=node@22.23 sha256:f326878dcad5…AssertionError [ERR_ASSERTION]: App declaration must contain <str> method · at runTests (<path>:<n>:<n>) · at Object.<anonymous> (<path>:<n>:<n>) …node · unclassified-diagnostic · outer node · gap stage-unknownQualité de preuve: complete · Variantes d’environnement: 1 · Premier relevé: 2026-08-29 · Dernière observation: 2026-08-29Candidat à une revérification diagnostique
-
observé UNKNOWN exit 1 ERR_ASSERTION Lacune de preuve ×1 3.0.0 executionContext=node · moduleSystem=cjs · os=linux · runtime=node@22.23 sha256:0d62cac8c07a…AssertionError [ERR_ASSERTION]: Expected values to be strictly equal: · + actual - expected · + <str> · - <str>node · unclassified-diagnostic · outer node · gap stage-unknownQualité de preuve: complete · Variantes d’environnement: 1 · Premier relevé: 2026-08-30 · Dernière observation: 2026-08-30Candidat à une revérification diagnostique
-
observé UNKNOWN exit 1 Lacune de preuve ×1 3.0.0 executionContext=node · moduleSystem=cjs · os=linux · runtime=node@22.23 sha256:e1d65fc7c136…<path>:<n> · throw new Error(`Unsupported arch ${name}`) · ^ · Error: Unsupported arch 1node · unclassified-diagnostic · outer node · gap stage-unknownQualité de preuve: complete · Variantes d’environnement: 1 · Premier relevé: 2026-08-30 · Dernière observation: 2026-08-30Candidat à une revérification diagnostique
-
observé UNKNOWN exit 1 ERR_ASSERTION Lacune de preuve ×1 3.0.0 executionContext=node · moduleSystem=cjs · os=linux · runtime=node@22.23 sha256:509afba8c7b2…node:assert:<n> · throw err; · ^ · AssertionError [ERR_ASSERTION]: The input did not match the regular expression <path> image path cannot be empty/. Input:node · unclassified-diagnostic · outer node · gap stage-unknownQualité de preuve: complete · Variantes d’environnement: 1 · Premier relevé: 2026-08-31 · Dernière observation: 2026-08-31Candidat à une revérification diagnostique
-
observé UNKNOWN exit 1 Lacune de preuve ×1 3.0.0 executionContext=node · moduleSystem=cjs · os=linux · runtime=node@22.23 sha256:13e610412b4d…<path> · <path>· unclassified-diagnostic · gap stage-unknownQualité de preuve: complete · Variantes d’environnement: 1 · Premier relevé: 2026-08-31 · Dernière observation: 2026-08-31Candidat à une revérification diagnostique
-
observé UNKNOWN exit 1 Lacune de preuve ×1 3.0.0 executionContext=node · moduleSystem=cjs · os=linux · runtime=node@22.23 sha256:1efba491e785…Traceback (most recent call last): · File <str>, line 153, in <module> · main() · File <str>, line 144, in mainpython3 · unclassified-diagnostic · outer python3 · gap stage-unknownQualité de preuve: complete · Variantes d’environnement: 1 · Premier relevé: 2026-08-31 · Dernière observation: 2026-08-31Candidat à une revérification diagnostique
Affichage des 12 plus signalés parmi 26 groupes d’échecs enregistrés. Le reste sont des signalements uniques.