記録npmglob7.2.3
条件を変更
現在の条件
glob @7.2.3windows 11 · x64 · node 24 · pnpm 10 · node
API ではなくパッケージ全体の合計
229 回中 0 回が成功
検証 — このネットワークがこの座標でコントラクトを実行しました。
サンプルあり — この座標で実行し、失敗した (1)
- プロジェクト観測
- 294 / 390
- コントラクト検証
- 0 / 229
- 使用記録
- 1,254
- 独立した報告ピア
- 1
- fingerprint を収集した失敗
- 95 / 96
- 最終記録
- 2026-09-26
開ける証拠
依存関係のヘルス
このリリースの依存関係の組み合わせと失敗観測
観測された問題 1件 ·
変更 2件 ·
正常 5件
| ライブラリ | バージョン | ヘルス | その座標で測定されたこと | プロジェクト |
|---|---|---|---|---|
| minimatch | 3.1.2 | CANDIDATE 相関変更; 組み合わせ未証明 | コントラクト合格 | プロジェクト日 3 件 |
| minimatch | 3.1.5 | CANDIDATE 相関変更; 組み合わせ未証明 | コントラクト合格 | プロジェクト日 70 件 |
| fs.realpath | 1.0.0 | PASS すべての観測で成功 | コントラクト合格 | プロジェクト日 66 件 |
| inflight | 1.0.6 | PASS すべての観測で成功 | コントラクト合格 | プロジェクト日 64 件 |
| inherits | 2.0.4 | PASS すべての観測で成功 | コントラクト合格 | プロジェクト日 68 件 |
| once | 1.4.0 | PASS すべての観測で成功 | コントラクト合格 | プロジェクト日 68 件 |
| path-is-absolute | 1.0.1 | PASS すべての観測で成功 | コントラクト合格 | プロジェクト日 63 件 |
測定列は各依存関係自身のリリースに関するもので、2つのリリースの組み合わせに関するものではありません。リゾルバが2つを並べたという事実は、両者が協調して動く証拠ではありません。
リリースごとの依存バージョン
このパッケージの各リリースが子をどのバージョンに解決したかです。バージョンが動いた子が先に並びます — アップグレードが足元で何かを変えた地点です。
| ライブラリ | 13.0.6 | 13.0.0 | 10.5.0 | 10.3.10 | 8.1.0 | 7.2.3 |
|---|---|---|---|---|---|---|
| jackspeak | — | — | 3.4.3 | 2.3.6 | — | — |
| minimatch | 10.2.5 | 10.1.1 | 9.0.5 | 9.0.5 | 5.1.9 | 3.1.2 |
| minipass | 7.1.3 | 7.1.2 | 7.1.2 | 7.1.2 | — | — |
| path-scurry | 2.0.2 | 2.0.1 | 1.11.1 | 1.11.1 | — | — |
| foreground-child | — | — | 3.3.1 | 3.3.1 | — | — |
| fs.realpath | — | — | — | — | 1.0.0 | 1.0.0 |
| inflight | — | — | — | — | 1.0.6 | 1.0.6 |
| inherits | — | — | — | — | 2.0.4 | 2.0.4 |
| once | — | — | — | — | 1.4.0 | 1.4.0 |
| package-json-from-dist | — | — | 1.0.1 | — | — | — |
| path-is-absolute | — | — | — | — | — | 1.0.1 |
変動: 4 · 全リリースで同一: 7
エッジは、実機でリゾルバがあるリリースを別のリリースの隣に置いたという記録です。両者が一緒に動くという主張ではありません。その問いに答えるのは、ここに行があることではなくサンプルと契約です。
最近の失敗クラスター
-
観測済み UNKNOWN exit 1 ERR_PNPM_RECURSIVE_RUN_FIRST_FAIL 証拠の欠落 ×32 7.2.3 executionContext=node · moduleSystem=esm · os=windows · runtime=node@24.13 sha256:9f91c9753081…(node:<n>) ExperimentalWarning: SQLite is an experimental feature and might change at any time …pnpm · unclassified-diagnostic · outer pnpm · gap stage-unknown証拠品質: complete · 環境バリアント: 1 · 初回記録: 2026-09-01 · 最終観測: 2026-09-17診断再検証候補
-
観測済み UNKNOWN exit 1 ERR_PNPM_RECURSIVE_EXEC_FIRST_FAIL 証拠の欠落 ×28 7.2.3 executionContext=node · moduleSystem=esm · os=windows · runtime=node@24.13 sha256:979755e6489d…(node:<n>) ExperimentalWarning: SQLite is an experimental feature and might change at any time …pnpm · unclassified-diagnostic · outer pnpm · gap stage-unknown証拠品質: complete · 環境バリアント: 1 · 初回記録: 2026-09-01 · 最終観測: 2026-09-15診断再検証候補
-
観測済み PROJECT_COMPILE exit 2 TS2307 ×12 7.2.3 → 10.3.10 → 10.5.0 executionContext=node · moduleSystem=cjs · os=windows · runtime=node@24.13 sha256:0470f88d95bb…lib/hooks/queries/index.ts(<n>,<n>): error TS2307: Cannot find module <str> or its corresponding type declarations. …typescript/tsc · compiler-diagnostic証拠品質: complete · 環境バリアント: 1 · 初回記録: 2026-09-01 · 最終観測: 2026-09-01
-
観測済み PROJECT_COMPILE exit 2 TS7006 ×12 7.2.3 → 10.3.10 → 10.5.0 executionContext=node · moduleSystem=cjs · os=windows · runtime=node@24.13 sha256:21025cd78572…app/api/politicians/[id]/real-estates/route.ts(<n>,<n>): error TS7006: Parameter <str> implicitly has an <str> type. …typescript/tsc · compiler-diagnostic証拠品質: complete · 環境バリアント: 1 · 初回記録: 2026-09-01 · 最終観測: 2026-09-01
-
観測済み PROJECT_COMPILE exit 2 TS2561 ×12 7.2.3 → 10.3.10 → 10.5.0 executionContext=node · moduleSystem=cjs · os=windows · runtime=node@24.13 sha256:5f96e966539e…app/api/politicians/[id]/real-estates/route.ts(<n>,<n>): error TS2561: Object literal may only specify known properties, but <str> does not exist in type …typescript/tsc · compiler-diagnostic証拠品質: complete · 環境バリアント: 1 · 初回記録: 2026-09-01 · 最終観測: 2026-09-01
-
観測済み PROJECT_COMPILE exit 2 TS2345 ×12 7.2.3 → 10.3.10 → 10.5.0 executionContext=node · moduleSystem=cjs · os=windows · runtime=node@24.13 sha256:7e077f646acc…lib/api/real-estate-statistics.ts(<n>,<n>): error TS2345: Argument of type <str> is not assignable to parameter of type <str>.typescript/tsc · compiler-diagnostic証拠品質: complete · 環境バリアント: 1 · 初回記録: 2026-09-01 · 最終観測: 2026-09-01
-
観測済み PROJECT_COMPILE exit 2 TS2551 ×12 7.2.3 → 10.3.10 → 10.5.0 executionContext=node · moduleSystem=cjs · os=windows · runtime=node@24.13 sha256:8a1ebc675f2b…app/api/politicians/[id]/real-estates/route.ts(<n>,<n>): error TS2551: Property <str> does not exist on type <str>. Did you mean <str>? …typescript/tsc · compiler-diagnostic証拠品質: complete · 環境バリアント: 1 · 初回記録: 2026-09-01 · 最終観測: 2026-09-01
-
観測済み PROJECT_COMPILE exit 2 TS2339 ×12 7.2.3 → 10.3.10 → 10.5.0 executionContext=node · moduleSystem=cjs · os=windows · runtime=node@24.13 sha256:e51205820175…lib/api/real-estate-map-addresses.ts(<n>,<n>): error TS2339: Property <str> does not exist on type <str>.typescript/tsc · compiler-diagnostic証拠品質: complete · 環境バリアント: 1 · 初回記録: 2026-09-01 · 最終観測: 2026-09-01
-
観測済み PROJECT_COMPILE exit 2 TS2305 ×12 7.2.3 → 10.3.10 → 10.5.0 executionContext=node · moduleSystem=cjs · os=windows · runtime=node@24.13 sha256:e7aa54217e13…app/api/politicians/[id]/real-estates/route.ts(<n>,<n>): error TS2305: Module <str> has no exported member <str>. …typescript/tsc · compiler-diagnostic証拠品質: complete · 環境バリアント: 1 · 初回記録: 2026-09-01 · 最終観測: 2026-09-01
-
観測済み UNKNOWN exit 1 ERR_PNPM_RECURSIVE_EXEC_FIRST_FAIL 証拠の欠落 ×11 7.2.3 executionContext=node · moduleSystem=esm · os=windows · runtime=node@24.13 sha256:73873d2c4aed…<str> is not recognized as an internal or external command, · operable program or batch file. · undefined …pnpm · unclassified-diagnostic · outer pnpm · gap stage-unknown証拠品質: complete · 環境バリアント: 1 · 初回記録: 2026-09-01 · 最終観測: 2026-09-01診断再検証候補
-
観測済み PROJECT_TEST exit 1 ELIFECYCLE ×10 7.2.3 executionContext=node · moduleSystem=esm · os=windows · runtime=node@24.13 sha256:7711694d48fa…ELIFECYCLE Test failed. See above for more details.javascript/test-runner · test-runner-diagnostic · outer pnpm test証拠品質: complete · 環境バリアント: 1 · 初回記録: 2026-08-29 · 最終観測: 2026-09-01
-
観測済み PROCESS_START process start failed 証拠の欠落 ×10 7.2.3 → 8.1.0 executionContext=node sha256:c12549970456…· structured-termination · gap diagnostic-missing証拠品質: partial · 環境バリアント: 2 · 初回記録: 2026-08-31 · 最終観測: 2026-09-16診断再検証候補
最も多く報告された 12 件を表示しています。この座標に記録された失敗クラスタは 309 件です。残りは単発の報告です。